{"text_format":"3","workbook":"xlsx","n_sheets":10,"sheets":["Instructions","Farm Summary","VNMP Approval Sheet","VNMP ","VRT Review Tool","2020 Tri-State VNMP","2020 Tri-State VRT Review Tool","Updates","Nutrient Price Calculator","Nutrient Price Calculator (2)"],"not_rendered":{"images":3,"macros":1,"external_links":2,"defined_names":51},"read":"whole","date_system":"1900"}

{"sheet":"Instructions","index":0,"n_rows":25,"n_cols":2,"rows_kept":25}
[]
[null,"Notes for Users of ODA VNMP & VRT Review Tool"]
[null,"This tool is intended to provide producers with information; it will provide field level average recommendations for review or as a part of a Nutrient Management Plan. Specifically, this tool provides information related to the management of crop fertility needs through the addition of commercial fertilizers and customized nutrients (manure, custom blended fertilizers, bio-solids, compost, etc.). Use of this tool does not relieve the producer from the obligation to fully understand and abide by all applicable rules, regulations, and standards. This tool can be used to create a Nutrient Management Plan in a form approved by the Ohio Department of Agriculture. The tool primarily references two complementary documents. The \"Tri-State Fertilizer Recommendations For Corn, Soybeans, Wheat, & Alfalfa (1995)\" and The \"Tri-State Fertilizer Recommendations For Corn, Soybeans, Wheat, & Alfalfa (2020)\" are used to determine fertility recommendations for a given crop or rotation of crops. The user will need to select (using the buttons below) what version of Tri-State they would like to write the plan with.   The NRCS Practice Standard 590 (December 2020) is used to identify maximum nutrient application rates to minimize non-point source pollution of surface and groundwater resources. NRCS 590 applies to the application of all nutrient sources, and it refers to the \"Tri-State Fertilizer Recommendations\" throughout. "]
[null,"Farm Summary"]
[null,"The intent of this document is to record what the producers typically do from a nutrient application standpoint on their farm.  This summary will be submitted in conjunction with field level prescription maps and soil tests to meet the minimum requirements of an Ohio Voluntary Nutrient Management Plan.  Crops should be planned in typical rotation 1-5, use the notes to document additional rotations used on the farm.                                                                                                                                                                                                                                                                                                 • Lists of typical crops found in Ohio are available through a drop-down menu, if the crop is not available you can type the crop directly in the column on the PDF, or within the Excel spreadsheet you can leave blank and hand write in the crop later.\n• Lists of typical fertilizers found in Ohio are available through a drop-down menu, if the fertilizer is not available please leave blank and hand write it in after printing or within the Excel spreadsheet you can utilize the “Custom Fertilizer” inputs to add up to three products to the drop down lists\n• Within the manure row, other nutrients can be documented, for example, compost, biosolids, litter can all be documented within the manure row.\n• An analysis will not populate for manures, litters, compost, etc.  You can either type in the N-P-K analysis or write it in the notes are the bottom for lbs/ton or lbs/1000 gals.\n• If you need additional crops create another document.\n• Please provide any additional details not documented in the Notes at the bottom"]
[null,"VRT Review Tool & 2020 Tri-State VRT Review Tool"]
[null,"The VRT Review Tool is designed to review Variable Rate Application Recommendations from ag retailers.  Pick 3 soil tests to review and input soil test levels.  Input crop and yield data for recommendations.  We recommend selecting a soil test level in the Drawdown, Maintenance, and Build-up range to see if ag retailers recommendations match \"Tri-State Fertilizer Recommendations\".  Answer the \"checklist\" at the bottom of the sheet to fulfill requirements for documentation of the 4R's.  If additional comments are needed use the section to document decisions.  Use \"Add Field\" button to add additional fields to the plan, the new workbooks will not have the \"Buttons\" for \"Add Field\", \"Print\", \"Clear Data\", \"Save as PDF\" functions.  You will need to go back to the original Workbook to \"Add Fields\".  If fields typically have wheat, alfalfa or other cool season forage crops in rotation and the critical soil test level is managed for this, select \"Yes\" in the \"Build for Wheat & Alfalfa\""]
[null,"VNMP Approval Sheet - Fill out 'VNMP Approval Sheet'  tab with producer information and  'Starting Month/Year'.  "]
[null,"VNMP & 2020 Tri-State VNMP"]
[null,"Step 1 - Fields should represent 25 ac or less. Enter the field and soil test information, input all soil test levels and select P extraction method using the drop-down lists.  Note that both the \"Tri-State Fertilizer Recommendations\" and NRCS Practice Standard 590 are based on soil test P values using the Bray P1 extraction method for soil phosphorous. The tool will convert Mehlich 3 ICP values to Bray P1 using the conversion of [-8.08+(0.832*Soil Test Level)]."]
[null,"Step 2 - The next step is to enter information related to the crop rotation for the planning period.  Enter the yield goal for each crop that will be grown for each year of the planning period (grain crop yields in bu/acre and forages in tons/acre). The planning period includes the crops to be fertilized. Based on the input soil test information, the tool will use the \"Tri-State Fertilizer Recommendations\" and will calculate the total nutrient recommendations for the proposed crop rotation in the planning period.  Once crop information is entered, planning on nutrient applications can be made.  If fields typically have wheat, alfalfa or other cool season forage crops in rotation and the critical soil test level is managed for this, select \"Yes\" in the \"Build for Wheat & Alfalfa\""]
[null,"Step 3 - For Nutrient Application Plan, Start with selecting the target crop and the source of fertilizer.  Then select the target rate and nutrient for the fertilizer application.  The planned amount will need to be entered by the user.  Adjustments may need to be made to meet crop needs and the target rates.  \"Nutrient Planned\" boxes will turn green when nutrient needs are met for the four year rotation.  The \"Nutrient Planned\" boxes will turn green if they are within 2 lbs of the recommendation.  Lastly, select the season, year, and application method for the nutrient application.  Consider all 4R stewardship practices when planning a nutrient application, Right Source, Right Rate, Right Time, Right Place. Use \"Add Field\" button to add additional fields to the plan, the new workbooks will not have the \"Buttons\" for \"Add Field\", \"Print\", \"Clear Data\", \"Save as PDF\" functions.  You will need to go back to the original Workbook to \"Add Fields\". "]
[null,"Notes: "]
[null,"*Nitrogen Rates - N rates are based on \"Tri-State Fertilizer Recommendations For Corn, Soybeans, Wheat, & Alfalfa (2000)\".  NRCS 590 standard requires the use of a Maximum Return To Nitrogen (MRTN) or Economic Threshold models for nitrogen applications.  Rates recommended are for reference only, consider field conditions, weather, prior N application credits, tillage system, nutrient placement, nutrient timing, and nutrient source when determining Nitrogen rates."]
[null,"*Yields - Yields are only calculated once per sheet per crop.  You cannot have a corn yield goal of 180 Bu/A and 200 Bu/A.  The first input yield goal will be the yield goal that is calculated within the sheet."]
[null,"*Custom Fertilizer - The use of manure, biosolids, custom blends, poultry litter, or any other nutrients with known nutrient analysis can be entered for use.  Select the appropriate units for each nutrient source.  This will populate the \"VRT Review Tool\" and the \"VNMP\"  for selecting nutrient sources.  These are calculated by the sheet individually, which is different than previous versions.  No calculations are made on Nutrient availability for any manure sources that may be used.  Additional guidance should be used to calculate nutrient availability for manures. "]
[null,"*Product Summary - Nutrients applied the fall before the crop will be calculated into the next years Product Summary. Ex. MAP applied in the Fall 2019 would be added to the 2020 MAP Product Summary."]
[null,"*Conversions - The VNMP and VRT Review Tool converts Mehlich to Bray using the conversions of [-8.08+ (Soil Test Level * 8.32)].  The 2020 Conversion for Tri-State Phosphorus used is discussed at https://ohioline.osu.edu/factsheet/anr-75. No conversion will be made for potassium with this tool.  Lbs. Ac to ppm = /2  PPM to Lbs. Ac = *2"]
[null,"Nutrient Products listed are commonly available in Ohio.  The products listed within the spreadsheet are not an endorsement nor a recommendation to use these products. "]
[null,"Tutorial Video"]
[null,"Below is a link to a Tutorial video that will provide guidance on the use of the VNMP and VRT Review Tools.  There have been several small modifications since the creation of tutorial video.  "]
[null,"https://www.youtube.com/watch?v=338AP8sonZM "]
[null,"Please contact Kip Studer for questions, errors, or help using this spreadsheet.  Kip.studer@agri.ohio.gov or 419-429-8329"]
[]
[null,"Select Version of Tri-State "]

{"sheet":"Farm Summary","index":1,"n_rows":66,"n_cols":25,"rows_kept":66,"merged":[[0,1,0,5],[0,9,0,10],[1,7,1,8],[2,1,2,2],[2,4,2,5],[2,7,2,8],[3,7,3,8],[4,7,4,8],[5,1,5,2],[5,3,5,4],[5,7,5,10],[5,11,6,12],[6,2,6,4],[6,5,6,6],[6,7,6,9],[7,2,7,4],[7,7,7,9],[7,11,7,12],[8,2,8,4],[8,7,8,9],[8,11,8,12],[9,0,9,1],[9,2,9,4],[9,7,9,9],[9,11,9,12],[10,2,10,4],[10,5,10,6],[10,7,10,9],[10,11,10,12],[11,2,11,4],[11,5,11,6],[11,7,11,9],[11,11,11,12],[12,2,12,4],[12,5,12,6],[12,7,12,9],[12,11,12,12],[14,1,14,2],[14,3,14,4],[14,11,15,12],[15,2,15,4],[15,5,15,6],[15,7,15,9],[16,2,16,4],[16,7,16,9],[16,11,16,12],[17,2,17,4],[17,7,17,9],[17,11,17,12],[18,0,18,1],[18,2,18,4],[18,7,18,9],[18,11,18,12],[19,2,19,4],[19,5,19,6],[19,7,19,9],[19,11,19,12],[20,2,20,4],[20,5,20,6],[20,7,20,9],[20,11,20,12],[21,2,21,4],[21,5,21,6],[21,7,21,9],[21,11,21,12],[23,1,23,2],[23,3,23,4],[23,11,24,12],[24,2,24,4],[24,5,24,6],[24,7,24,9],[25,2,25,4],[25,7,25,9],[25,11,25,12],[26,2,26,4],[26,7,26,9],[26,11,26,12],[27,0,27,1],[27,2,27,4],[27,7,27,9],[27,11,27,12],[28,2,28,4],[28,5,28,6],[28,7,28,9],[28,11,28,12],[29,2,29,4],[29,5,29,6],[29,7,29,9],[29,11,29,12],[30,2,30,4],[30,5,30,6],[30,7,30,9],[30,11,30,12],[32,1,32,2],[32,3,32,4],[32,11,33,12],[33,2,33,4],[33,5,33,6],[33,7,33,9],[34,2,34,4],[34,7,34,9],[34,11,34,12],[35,2,35,4],[35,7,35,9],[35,11,35,12],[36,0,36,1],[36,2,36,4],[36,7,36,9],[36,11,36,12],[37,2,37,4],[37,5,37,6],[37,7,37,9],[37,11,37,12],[38,2,38,4],[38,5,38,6],[38,7,38,9],[38,11,38,12],[39,2,39,4],[39,5,39,6],[39,7,39,9],[39,11,39,12],[41,1,41,2],[41,3,41,4],[41,11,42,12],[42,2,42,4],[42,5,42,6],[42,7,42,9],[43,2,43,4],[43,7,43,9],[43,11,43,12],[44,2,44,4],[44,7,44,9],[44,11,44,12],[45,0,45,1],[45,2,45,4],[45,7,45,9],[45,11,45,12],[46,2,46,4],[46,5,46,6],[46,7,46,9],[46,11,46,12],[47,2,47,4],[47,5,47,6],[47,7,47,9],[47,11,47,12],[48,2,48,4],[48,5,48,6],[48,7,48,9],[48,11,48,12],[49,0,49,12],[50,1,50,5],[50,8,52,12],[51,1,51,5],[52,1,52,5],[53,1,53,5],[53,8,53,12],[54,1,54,5],[54,8,54,12],[55,1,55,5],[57,0,61,12],[62,0,64,12]]}
["Name:",{"$nulls":6},"Total Acres"]
[{"$nulls":7},"Custom Fertlizer",null,"Unit","N","P","K",{"$nulls":3},"Ammonium Polyphosphate","gal.","10-34-0","Fall",{"$f":"Crop","v":"Alfalfa"},"Tons",{"$f":"AppMethod","v":"Select"}]
["Years",null,null,"-",{"$nulls":12},"Anhydrous Ammonia","lbs.","82-0-0","Spring","Barley","Bu/A",0]
[{"$nulls":16},"DAP","lbs.","18-46-0","Summer","Corn","Bu/A","Foliar"]
[{"$nulls":16},"KMag","lbs.","0-0-22-23",null,"Corn silage","Tons","Inject"]
["Crop 1",null,null,"Yield Goal",null,null,{"$f":"IFERROR(LOOKUP(B6,$U$2:$V$16,$V$2:$V$16),\"\")","v":""},"*Input Fertilizer as known N-P-K Analysis",{"$nulls":3},"Application Method",{"$nulls":4},"Liquid UAN 28%","gal.","28-0-0",null,"Grass pasture","Tons","Manure Spreader"]
[null,null,"Product/Manure Source",null,null,"Rate",null,"Analysis",null,null,"Season",{"$nulls":5},"Liquid UAN 32%","gal.","32-0-0","Flat Rate","Legume pasture","Tons","Pop-Up"]
["Starter",{"$nulls":5},{"$f":"IFERROR(INDEX(PlanLookup,MATCH(C8,PlanList,0),2),\"\")","v":0},{"$f":"IFERROR(INDEX(PlanLookup,MATCH(C8,PlanList,0),3),\"\")","v":""},{"$nulls":8},"MAP","lbs.","11-52-0","Variable Rate","Oats","Bu/A","Subsurface Band"]
["Sidedress",{"$nulls":5},{"$f":"IFERROR(INDEX(PlanLookup,MATCH(C9,PlanList,0),2),\"\")","v":0},"",{"$nulls":8},"Potash","lbs.","0-0-60",null,"Rye","Bu/A","Sidedress (Inject)"]
["Manure Application (If applicable)",{"$nulls":5},{"$f":"IFERROR(INDEX(PlanLookup,MATCH(C10,PlanList,0),2),\"\")","v":0},"",{"$nulls":8},"Sulfate of Potash","lbs.","0-0-50",{"$f":"Units","v":"Select"},"Sorghum","Bu/A","Broadcast W/ Incorp"]
["Nutrient Application",{"$nulls":6},"",{"$nulls":8},"Urea","lbs.","46-0-0",0,"Sorghum-sudan forage","Tons","Broadcast W/O Incorp"]
["Nutrient Application",{"$nulls":6},"",{"$nulls":8},"AMS (Ammonium Sulfate)","lbs.","21-0-0-24S","gal.","Soybean","Bu/A","Banding W/ Incorp"]
["Nutrient Application",{"$nulls":6},"",{"$nulls":8},"Liquid AMS","gal.","8-0-0-9S","lbs.","Spelt","Bu/A","Banding W/O Incorp"]
[{"$nulls":16},"MESZ®","lbs.","12-40-0","lbs/ton","Tomato ","Tons","On Growing Cover Crop"]
["Crop 2:",null,null,"Yield Goal:",null,null,{"$f":"IFERROR(LOOKUP(B15,$U$2:$V$16,$V$2:$V$16),\"\")","v":""},null,"",null,null,"Application Method",{"$nulls":4},"Liquid Manure","gal.",null,null,"Wheat","Bu/A","Starter"]
[null,null,"Product/Manure Source:",null,null,"Rate",null,"Analysis:",null,null,"Season",{"$nulls":5},"Solid Manure","Tons",null,null,"Wheat w/Stover","Bu/A"]
["Starter",{"$nulls":5},{"$f":"IFERROR(INDEX(PlanLookup,MATCH(C17,PlanList,0),2),\"\")","v":0},{"$f":"IFERROR(INDEX(PlanLookup,MATCH(C17,PlanList,0),3),\"\")","v":""},{"$nulls":8},"Poultry Litter","Tons"]
["Sidedress",{"$nulls":5},{"$f":"IFERROR(INDEX(PlanLookup,MATCH(C18,PlanList,0),2),\"\")","v":0},"",{"$nulls":8},"Compost (Ineligible for H2Ohio)","Tons"]
["Manure Application (If applicable)",{"$nulls":5},{"$f":"IFERROR(INDEX(PlanLookup,MATCH(C19,PlanList,0),2),\"\")","v":0},"",{"$nulls":8},"Biosolids (Ineligible for H2Ohio)","Tons"]
["Nutrient Application",{"$nulls":6},"",{"$nulls":8},{"$f":"H3","v":0},{"$f":"J3","v":0},{"$f":"IF(ISBLANK(K3),\"\",_xlfn.CONCAT(K3&\"-\"&L3&\"-\"&M3))","v":""}]
["Nutrient Application",{"$nulls":6},"",{"$nulls":8},{"$f":"H4","v":0},{"$f":"J4","v":0},{"$f":"IF(ISBLANK(K4),\"\",_xlfn.CONCAT(K4&\"-\"&L4&\"-\"&M4))","v":""}]
["Nutrient Application",{"$nulls":6},"",{"$nulls":8},{"$f":"H5","v":0},{"$f":"J5","v":0},{"$f":"IF(ISBLANK(K5),\"\",_xlfn.CONCAT(K5&\"-\"&L5&\"-\"&M5))","v":""}]
[{"$nulls":16},{"$f":"SUMPRODUCT(--(Q24:Q38={\"Variable Rate\"}))>0","v":false},{"$f":"SUMPRODUCT(--(R24:R53={\"Subsurface Band\",\"Inject\"}))>0","v":false},{"$f":"SUMPRODUCT(--(S24:S29={\"Poultry Litter\"}))>0","v":false},{"$f":"SUMPRODUCT(--(T24:T38={\"Solid Manure\",\"Liquid Manure\"}))>0","v":false},{"$f":"SUMPRODUCT(--(U24:U28={\"Wheat\",\"Barley\",\"Rye\",\"Spelt\",\"Wheat w/Stover\"}))>0","v":false},{"$f":"SUMPRODUCT(--(V24:V28={\"Alfalfa\",\"Grass pasture\",\"Legume pasture\"}))>0","v":false},null,{"$f":"IF(W24=TRUE,\"Variable Rate Phosphorus Application\",\"\")","v":""},{"$f":"IFERROR(INDEX(List,MATCH(0,COUNTIF($Y$22:Y22,List),0)),\"\")","v":""}]
["Crop 3:",null,null,"Yield Goal",null,null,{"$f":"IFERROR(LOOKUP(B24,$U$2:$V$16,$V$2:$V$16),\"\")","v":""},null,"",null,null,"Application Method",{"$nulls":4},{"$f":"F11","v":0},{"$f":"L8","v":0},{"$f":"C10","v":0},{"$f":"C10","v":0},{"$f":"B6","v":0},{"$f":"B6","v":0},{"$f":"Q23","v":false},{"$f":"IF(W25=TRUE,\"Subsurface Phosphorus Placement\",\"\")","v":""},{"$f":"IFERROR(INDEX(List,MATCH(0,COUNTIF($Y$22:Y23,List),0)),\"\")","v":""}]
[null,null,"Product/Manure Source",null,null,"Rate",null,"Analysis",null,null,"Season",{"$nulls":5},{"$f":"F12","v":0},0,{"$f":"C19","v":0},{"$f":"C19","v":0},{"$f":"B15","v":0},{"$f":"B15","v":0},{"$f":"R23","v":false},{"$f":"IF(W26=TRUE,\"Manure Incorporation - Poultry Litter\",\"\")","v":""},{"$f":"IFERROR(INDEX(List,MATCH(0,COUNTIF($Y$22:Y24,List),0)),\"\")","v":""}]
["Starter",{"$nulls":5},{"$f":"IFERROR(INDEX(PlanLookup,MATCH(C26,PlanList,0),2),\"\")","v":0},{"$f":"IFERROR(INDEX(PlanLookup,MATCH(C26,PlanList,0),3),\"\")","v":""},{"$nulls":8},{"$f":"F13","v":0},0,{"$f":"C28","v":0},{"$f":"C28","v":0},{"$f":"B24","v":0},{"$f":"B24","v":0},{"$f":"S23","v":false},{"$f":"IF(W27=TRUE,\"Manure Incorporation - All Other Manure\",\"\")","v":""},{"$f":"IFERROR(INDEX(List,MATCH(0,COUNTIF($Y$22:Y25,List),0)),\"\")","v":""}]
["Sidedress",{"$nulls":5},{"$f":"IFERROR(INDEX(PlanLookup,MATCH(C27,PlanList,0),2),\"\")","v":0},"",{"$nulls":8},{"$f":"F20","v":0},0,{"$f":"C37","v":0},{"$f":"C37","v":0},{"$f":"B33","v":0},{"$f":"B33","v":0},{"$f":"T23","v":false},{"$f":"IF(W28=TRUE,\"Conservation Crop Rotation – Small Grains\",\"\")","v":""},{"$f":"IFERROR(INDEX(List,MATCH(0,COUNTIF($Y$22:Y26,List),0)),\"\")","v":""}]
["Manure Application (If applicable)",{"$nulls":5},{"$f":"IFERROR(INDEX(PlanLookup,MATCH(C28,PlanList,0),2),\"\")","v":0},"",{"$nulls":8},{"$f":"F21","v":0},0,{"$f":"C46","v":0},{"$f":"C46","v":0},{"$f":"B42","v":0},{"$f":"B42","v":0},{"$f":"U23","v":false},{"$f":"IF(W29=TRUE,\"Conservation Crop Rotation – Forages\",\"\")","v":""},{"$f":"IFERROR(INDEX(List,MATCH(0,COUNTIF($Y$22:Y27,List),0)),\"\")","v":""}]
["Nutrient Application",{"$nulls":6},"",{"$nulls":8},{"$f":"F22","v":0},0,{"$f":"C46","v":0},{"$f":"C46","v":0},{"$f":"N13","v":0},null,{"$f":"V23","v":false},"Overwintering Cover Crops",{"$f":"IFERROR(INDEX($X$23:$X$28, MATCH(0,IF(ISBLANK($X$23:$X$28),1,COUNTIF($B$51:B57, $X$23:$X$28)), 0)),\"\")","v":""}]
["Nutrient Application",{"$nulls":6},"",{"$nulls":8},{"$f":"F29","v":0},{"$f":"L17","v":0},null,null,{"$f":"N17","v":0},null,null,"Drainage Water Management"]
["Nutrient Application",{"$nulls":6},"",{"$nulls":8},{"$f":"F30","v":0},0,null,null,{"$f":"N18","v":0}]
[{"$nulls":16},{"$f":"F31","v":0},0,null,{"$f":"N19","v":0}]
["Crop 4",null,null,"Yield Goal",null,null,{"$f":"IFERROR(LOOKUP(B33,$U$2:$V$16,$V$2:$V$16),\"\")","v":""},null,"",null,null,"Application Method",{"$nulls":4},{"$f":"F38","v":0},0,null,{"$f":"N20","v":0}]
[null,null,"Product/Manure Source",null,null,"Rate",null,"Analysis",null,null,"Season",{"$nulls":5},{"$f":"F39","v":0},0,null,{"$f":"N21","v":0}]
["Starter",{"$nulls":5},{"$f":"IFERROR(INDEX(PlanLookup,MATCH(C35,PlanList,0),2),\"\")","v":0},{"$f":"IFERROR(INDEX(PlanLookup,MATCH(C35,PlanList,0),3),\"\")","v":""},{"$nulls":8},{"$f":"F40","v":0},0,null,{"$f":"N22","v":0}]
["Sidedress",{"$nulls":5},{"$f":"IFERROR(INDEX(PlanLookup,MATCH(C36,PlanList,0),2),\"\")","v":0},"",{"$nulls":8},{"$f":"F47","v":0},{"$f":"L26","v":0},null,{"$f":"N26","v":0}]
["Manure Application (If applicable)",{"$nulls":5},{"$f":"IFERROR(INDEX(PlanLookup,MATCH(C37,PlanList,0),2),\"\")","v":0},"",{"$nulls":8},{"$f":"F48","v":0},0,null,0]
["Nutrient Application",{"$nulls":6},"",{"$nulls":8},{"$f":"F49","v":0},0,null,0]
["Nutrient Application",{"$nulls":6},"",{"$nulls":9},0,null,0]
["Nutrient Application",{"$nulls":6},"",{"$nulls":9},0,null,0]
[{"$nulls":17},0,null,0]
["Crop 5",null,null,"Yield Goal:",null,null,{"$f":"IFERROR(LOOKUP(B42,$U$2:$V$16,$V$2:$V$16),\"\")","v":""},null,"",null,null,"Application Method",{"$nulls":5},{"$f":"L35","v":0},null,{"$f":"N35","v":0}]
[null,null,"Product/Manure Source",null,null,"Rate",null,"Analysis:",null,null,"Season",{"$nulls":6},0,null,0]
["Starter",{"$nulls":5},{"$f":"IFERROR(INDEX(PlanLookup,MATCH(C44,PlanList,0),2),\"\")","v":0},{"$f":"IFERROR(INDEX(PlanLookup,MATCH(C44,PlanList,0),3),\"\")","v":""},{"$nulls":9},0,null,0]
["Sidedress",{"$nulls":5},{"$f":"IFERROR(INDEX(PlanLookup,MATCH(C45,PlanList,0),2),\"\")","v":0},"",{"$nulls":9},0,null,0]
["Manure Application (If applicable)",{"$nulls":5},{"$f":"IFERROR(INDEX(PlanLookup,MATCH(C46,PlanList,0),2),\"\")","v":0},"",{"$nulls":9},0,null,0]
["Nutrient Application",{"$nulls":6},"",{"$nulls":9},0,null,0]
["Nutrient Application",{"$nulls":6},"",{"$nulls":9},{"$f":"L44","v":0},null,{"$f":"N44","v":0}]
["Nutrient Application",{"$nulls":6},"",{"$nulls":9},0,null,0]
["H2Ohio Practices that may be considered based on your Nutrient Management Plan",{"$nulls":16},0,null,0]
[null,{"$f":"Y23","v":""},{"$nulls":6},"Please select from list below if producer plans to utilize Overwintering Cover Crops or Drainage Water Management",{"$nulls":8},0,null,0]
[null,{"$f":"Y24","v":""},{"$nulls":15},0,null,0]
[null,"",{"$nulls":15},0,null,0]
[null,""]
[null,""]
[null,""]
["Notes"]
[]
[]
[]
[]
[]
["Producer has reviewed the plan and understands that the OVNMP Plan Summary is part of an Ohio Voluntary Nutrient Management Plan which requires field level planning based on current soil tests.  Additional field level documentation is required which could include but not limited to prescription maps, variable rate prescriptions, or VNMP Sheets."]
[]
[]
["Produer Signature",{"$nulls":7},"Date"]

{"sheet":"VNMP Approval Sheet","index":2,"n_rows":27,"n_cols":6,"rows_kept":27,"merged":[[4,2,5,8],[6,2,7,8],[8,2,9,8],[13,3,13,4],[16,1,17,3],[16,4,17,8],[18,1,19,3],[20,1,21,3],[20,4,21,8],[22,1,23,3],[24,1,25,3],[24,4,25,8],[26,1,27,3]]}
[]
[]
[]
[]
[null,"Farmer:"]
[]
[null,"Address:"]
[]
[null,"Phone:"]
[]
[]
[null,"Starting Month/Year",{"$nulls":3},"-"]
[]
[null,"Total Acres:"]
[]
[]
[null,"Plan Writer Name & Title:"]
[]
[null,"Signature & Date:"]
[]
[null,"Producer Name:"]
[]
[null,"Signature & Date:"]
[]
[null,"Approver Name & Title:"]
[]
[null,"Signature & Date:"]

{"sheet":"VNMP ","index":3,"n_rows":284,"n_cols":71,"rows_kept":284,"hidden":true,"merged":[[0,1,0,26],[0,37,0,41],[0,43,0,44],[0,46,0,51],[1,1,1,26],[1,46,1,49],[2,1,3,5],[2,6,3,14],[2,15,3,18],[2,19,3,26],[4,1,4,26],[5,1,6,5],[5,6,6,14],[5,15,6,17],[5,18,6,26],[5,43,6,44],[7,1,8,5],[7,6,8,8],[7,9,8,11],[7,12,8,14],[7,15,8,17],[7,18,8,19],[7,20,8,21],[7,22,8,26],[9,1,9,26],[10,1,10,5],[10,6,10,10],[10,11,10,13],[10,14,10,16],[10,17,10,22],[10,23,10,26],[11,1,11,11],[11,12,11,14],[11,15,11,17],[11,18,11,20],[11,21,11,26],[12,1,13,11],[12,12,13,14],[12,15,13,17],[12,18,13,20],[12,21,13,26],[14,1,14,26],[15,1,16,5],[15,6,16,11],[15,12,16,17],[15,18,15,26],[16,18,16,20],[16,21,16,23],[16,24,16,26],[17,1,17,5],[17,6,17,11],[17,12,17,15],[17,16,17,17],[17,18,17,20],[17,21,17,23],[17,24,17,26],[18,1,18,5],[18,6,18,11],[18,12,18,15],[18,16,18,17],[18,18,18,20],[18,21,18,23],[18,24,18,26],[18,43,18,46],[19,1,19,5],[19,6,19,11],[19,12,19,15],[19,16,19,17],[19,18,19,20],[19,21,19,23],[19,24,19,26],[19,43,19,46],[20,1,20,5],[20,6,20,11],[20,12,20,15],[20,16,20,17],[20,18,20,20],[20,21,20,23],[20,24,20,26],[21,1,22,12],[21,13,21,17],[21,18,21,20],[21,21,21,23],[21,24,21,26],[21,43,21,44],[21,45,21,46],[22,13,22,17],[22,18,22,20],[22,21,22,23],[22,24,22,26],[22,43,22,44],[22,45,22,46],[23,1,24,2],[23,3,23,7],[23,8,23,18],[23,19,23,22],[23,23,23,26],[24,3,24,7],[24,8,24,9],[24,10,24,12],[24,13,24,14],[24,15,24,16],[24,17,24,18],[24,19,24,20],[24,21,24,22],[24,23,24,26],[25,1,25,2],[25,3,25,7],[25,8,25,9],[25,10,25,11],[25,13,25,14],[25,15,25,16],[25,17,25,18],[25,19,25,20],[25,21,25,22],[25,23,25,26],[26,1,26,2],[26,3,26,7],[26,8,26,9],[26,10,26,11],[26,13,26,14],[26,15,26,16],[26,17,26,18],[26,19,26,20],[26,21,26,22],[26,23,26,26],[27,1,27,2],[27,3,27,7],[27,8,27,9],[27,10,27,11],[27,13,27,14],[27,15,27,16],[27,17,27,18],[27,19,27,20],[27,21,27,22],[27,23,27,26],[28,1,28,2],[28,3,28,7],[28,8,28,9],[28,10,28,11],[28,13,28,14],[28,15,28,16],[28,17,28,18],[28,19,28,20],[28,21,28,22],[28,23,28,26],[29,1,29,2],[29,3,29,7],[29,8,29,9],[29,10,29,11],[29,13,29,14],[29,15,29,16],[29,17,29,18],[29,19,29,20],[29,21,29,22],[29,23,29,26],[30,1,30,2],[30,3,30,7],[30,8,30,9],[30,10,30,11],[30,13,30,14],[30,15,30,16],[30,17,30,18],[30,19,30,20],[30,21,30,22],[30,23,30,26],[31,1,31,2],[31,3,31,7],[31,8,31,9],[31,10,31,11],[31,13,31,14],[31,15,31,16],[31,17,31,18],[31,19,31,20],[31,21,31,22],[31,23,31,26],[32,1,32,2],[32,3,32,7],[32,8,32,9],[32,10,32,11],[32,13,32,14],[32,15,32,16],[32,17,32,18],[32,19,32,20],[32,21,32,22],[32,23,32,26],[32,37,32,42],[33,1,33,2],[33,3,33,7],[33,8,33,9],[33,10,33,11],[33,13,33,14],[33,15,33,16],[33,17,33,18],[33,19,33,20],[33,21,33,22],[33,23,33,26],[34,1,34,2],[34,3,34,7],[34,8,34,9],[34,10,34,11],[34,13,34,14],[34,15,34,16],[34,17,34,18],[34,19,34,20],[34,21,34,22],[34,23,34,26],[35,1,35,2],[35,3,35,7],[35,8,35,9],[35,10,35,11],[35,13,35,14],[35,15,35,16],[35,17,35,18],[35,19,35,20],[35,21,35,22],[35,23,35,26],[36,1,36,8],[36,9,36,26],[37,1,37,6],[37,7,37,8],[37,9,37,13],[37,14,37,16],[37,17,37,19],[37,20,37,22],[37,23,37,25],[38,1,38,2],[38,3,38,4],[38,5,38,6],[38,9,38,13],[38,14,38,16],[38,17,38,19],[38,20,38,22],[38,23,38,25],[39,1,39,2],[39,3,39,4],[39,5,39,6],[39,7,39,8],[39,9,39,13],[39,14,39,16],[39,17,39,19],[39,20,39,22],[39,23,39,25],[40,1,40,6],[40,7,40,8],[40,9,40,13],[40,14,40,16],[40,17,40,19],[40,20,40,22],[40,23,40,25],[41,1,41,2],[41,3,41,4],[41,5,41,6],[41,9,41,13],[41,14,41,16],[41,17,41,19],[41,20,41,22],[41,23,41,25],[42,1,42,2],[42,3,42,4],[42,5,42,6],[42,7,42,8],[42,9,42,13],[42,14,42,16],[42,17,42,19],[42,20,42,22],[42,23,42,25],[42,37,42,40],[43,1,43,5],[43,6,43,8],[43,9,43,13],[43,14,43,16],[43,17,43,19],[43,20,43,22],[43,23,43,25],[44,1,45,8],[44,9,44,13],[44,14,44,16],[44,17,44,19],[44,20,44,22],[44,23,44,25],[44,43,44,48],[45,9,45,13],[45,14,45,16],[45,17,45,19],[45,20,45,22],[45,23,45,25],[46,1,48,26],[50,1,85,1],[50,2,55,4],[50,5,55,7],[50,8,55,10],[50,11,55,13],[50,14,55,16],[50,17,55,19],[50,20,55,22],[50,23,55,25],[56,2,60,4],[56,5,60,7],[56,8,60,10],[56,11,60,13],[56,14,60,16],[56,17,60,19],[56,20,60,22],[56,23,60,25],[61,2,65,4],[61,5,65,7],[61,8,65,10],[61,11,65,13],[61,14,65,16],[61,17,65,19],[61,20,65,22],[61,23,65,25],[66,2,69,4],[66,5,69,7],[66,8,69,10],[66,11,69,13],[66,14,69,16],[66,17,69,19],[66,20,69,22],[66,23,69,25],[70,2,73,4],[70,5,73,7],[70,8,73,10],[70,11,73,13],[70,14,73,16],[70,17,73,19],[70,20,73,22],[70,23,73,25],[74,2,77,4],[74,5,77,7],[74,8,77,10],[74,11,77,13],[74,14,77,16],[74,17,77,19],[74,20,77,22],[74,23,77,25],[78,2,81,4],[78,5,81,7],[78,8,81,10],[78,11,81,13],[78,14,81,16],[78,17,81,19],[78,20,81,22],[78,23,81,25],[82,2,85,4],[82,5,85,7],[82,8,85,10],[82,11,85,13],[82,14,85,16],[82,17,85,19],[82,20,85,22],[82,23,85,25],[86,1,93,1],[86,2,89,4],[86,5,89,7],[86,8,89,10],[86,11,89,13],[86,14,89,16],[86,17,89,19],[86,20,89,22],[86,23,89,25],[90,2,93,4],[90,5,93,7],[90,8,93,10],[90,11,93,13],[90,14,93,16],[90,17,93,19],[90,20,93,22],[90,23,93,25]]}
[{"$nulls":37},"Nutrient Removal Reference Table",{"$nulls":5},"Soil Test Units",null,null,"Plant Available Nitrogen Chart",{"$nulls":7},"Fertilizers","Nutrient Density","Nutrient Concentration",null,null,"form","Application Amount",{"$nulls":3},"Density","N","P","K","N","P","K"]
[{"$nulls":37},"Crop","Unit","N","P","K",null,"lb/ac",null,null,"Application & Incorporation Plan",{"$nulls":3},"Organic N","Ammonia N",{"$nulls":3},"N","N","P2O5","K2O",{"$nulls":4},{"$f":"D26","v":{"v":0,"d":"0.00"}},{"$f":"IFERROR(INDEX($BC$3:$BH$17,MATCH($D26,$BC$3:$BC$17,0),2,1),\"\")","v":""},{"$f":"IFERROR(INDEX($BC$3:$BH$17,MATCH($D26,$BC$3:$BC$17,0),3,1),\"\")","v":""},{"$f":"IFERROR(INDEX($BC$3:$BH$17,MATCH($D26,$BC$3:$BC$17,0),4,1),\"\")","v":""},{"$f":"IFERROR(INDEX($BC$3:$BH$17,MATCH($D26,$BC$3:$BC$17,0),5,1),\"\")","v":""},{"$f":"(BN2*$K26)*INDEX($BC$3:$BD$17,MATCH($BL2,$BC$3:$BC$17,0),2)","v":{"$error":"#VALUE!"}},{"$f":"(BO2*$K26)*INDEX($BC$3:$BD$17,MATCH($BL2,$BC$3:$BC$17,0),2)","v":{"$error":"#VALUE!"}},{"$f":"(BP2*$K26)*INDEX($BC$3:$BD$17,MATCH($BL2,$BC$3:$BC$17,0),2)","v":{"$error":"#VALUE!"}}]
[null,"Name",{"$nulls":13},"Phone",{"$nulls":21},"Alfalfa","Ton",null,13,50,null,"ppm",null,null,"Mar - Apr Application; < 3 Days to Incorp",{"$nulls":3},{"v":0.33,"d":"33%"},{"v":0.5,"d":"50%"},null,null,"APP - (10-34-0)",11.7,{"v":0.1,"d":"10%"},{"v":0.34,"d":"34%"},{"v":0,"d":"0%"},"gal.","Starter",null,null,{"$f":"D27","v":{"v":0,"d":"0.00"}},{"$f":"IFERROR(INDEX($BC$3:$BH$17,MATCH($D27,$BC$3:$BC$17,0),2,1),\"\")","v":""},{"$f":"IFERROR(INDEX($BC$3:$BH$17,MATCH($D27,$BC$3:$BC$17,0),3,1),\"\")","v":""},{"$f":"IFERROR(INDEX($BC$3:$BH$17,MATCH($D27,$BC$3:$BC$17,0),4,1),\"\")","v":""},{"$f":"IFERROR(INDEX($BC$3:$BH$17,MATCH($D27,$BC$3:$BC$17,0),5,1),\"\")","v":""},{"$f":"(BN3*$K27)*INDEX($BC$3:$BD$17,MATCH($BL3,$BC$3:$BC$17,0),2)","v":{"$error":"#VALUE!"}},{"$error":"#VALUE!"},{"$f":"(BP3*$K27)*INDEX($BC$3:$BD$17,MATCH($BL3,$BC$3:$BC$17,0),2)","v":{"$error":"#VALUE!"}}]
[{"$nulls":37},"Barley","Bu",null,0.25,0.2,{"$nulls":4},"Mar - Apr Application; > 3 Days to Incorp",{"$nulls":3},{"v":0.33,"d":"33%"},{"v":0.25,"d":"25%"},null,null,"Anhydrous Am - (82-0-0)",1,{"v":0.82,"d":"82%"},{"v":0,"d":"0%"},{"v":0,"d":"0%"},"lbs.","1 Year N",null,null,{"$f":"D28","v":{"v":0,"d":"0.00"}},"","","","",{"$error":"#VALUE!"},{"$error":"#VALUE!"},{"$error":"#VALUE!"}]
[null,"Field Information",{"$nulls":35},"Bluegrass pasture","Ton",null,7.33,50,{"$nulls":4},"Apr - June Application; < 1 Days to Incorp",{"$nulls":3},{"v":0.33,"d":"33%"},{"v":0.75,"d":"75%"},null,null,"DAP - (18-46-0)",1,{"v":0.18,"d":"18%"},{"v":0.46,"d":"46%"},{"v":0,"d":"0%"},"lbs.","1 Year P",null,null,{"v":0,"d":"0.00"},"","","","",{"$error":"#VALUE!"},{"$error":"#VALUE!"},{"$error":"#VALUE!"}]
[null,"Field Name",{"$nulls":13},"Field Location",{"$nulls":21},"Bluegrass seeding","Ton",null,7.33,50,null,"Soil Test Phosphorus Test Method",null,null,"Apr - June Application; > 1 Days to Incorp",{"$nulls":3},{"v":0.33,"d":"33%"},{"v":0.25,"d":"25%"},null,null,"KMag -  (0-0-22-23)",1,{"v":0,"d":"0%"},{"v":0,"d":"0%"},{"v":0.22,"d":"22%"},"lbs.","2 Year P",null,null,{"v":0,"d":"0.00"},"","","","",{"$error":"#VALUE!"},{"$error":"#VALUE!"},{"$error":"#VALUE!"}]
[{"$nulls":37},"Canola","Bu",null,0.7,0.46,{"$nulls":4},"Jul - Aug Application; < 1 Days to Incorp",{"$nulls":3},{"v":0.15,"d":"15%"},{"v":0.75,"d":"75%"},null,null,"Liquid UAN - (28-0-0)",10.7,{"v":0.28,"d":"28%"},{"v":0,"d":"0%"},{"v":0,"d":"0%"},"gal.","3 Year P",null,null,{"v":0,"d":"0.00"},"","","","",{"$error":"#VALUE!"},{"$error":"#VALUE!"},{"$error":"#VALUE!"}]
[null,"FSA Farm #",{"$nulls":7},"FSA Tract #",{"$nulls":5},"Field Size",{"$nulls":4},"Ac",{"$nulls":16},"Corn","Bu",null,0.37,0.27,null,"Bray P1",null,null,"Jul - Aug Application; > 1 Days to Incorp",{"$nulls":3},{"v":0.15,"d":"15%"},{"v":0.25,"d":"25%"},null,null,"Liquid UAN - (32-0-0)",10.7,{"v":0.32,"d":"32%"},{"v":0,"d":"0%"},{"v":0,"d":"0%"},"gal.","1 Year K",null,null,{"v":0,"d":"0.00"},"","","","",{"$error":"#VALUE!"},{"$error":"#VALUE!"},{"$error":"#VALUE!"}]
[{"$nulls":37},"Corn silage","Ton",null,3.3,8,null,"Mehlich III",null,null,"Sep - Oct Application; < 1 Days to Incorp",{"$nulls":3},{"v":0.33,"d":"33%"},{"v":0.25,"d":"25%"},null,null,"MAP - (11-52-0)",1,{"v":0.11,"d":"11%"},{"v":0.52,"d":"52%"},{"v":0,"d":"0%"},"lbs.","2 Year K",null,null,{"v":0,"d":"0.00"},"","","","",{"$error":"#VALUE!"},{"$error":"#VALUE!"},{"$error":"#VALUE!"}]
[null,"Soil Test Results",{"$nulls":35},"Grass pasture","Ton",null,13,50,{"$nulls":4},"Sep - Oct Application; > 1 Days to Incorp",{"$nulls":3},{"v":0.33,"d":"33%"},{"v":0.15,"d":"15%"},null,null,"Potash - (0-0-60)",1,{"v":0,"d":"0%"},{"v":0,"d":"0%"},{"v":0.6,"d":"60%"},"lbs.","3 Year K",null,null,{"v":0,"d":"0.00"},"","","","",{"$error":"#VALUE!"},{"$error":"#VALUE!"},{"$error":"#VALUE!"}]
[null,"Soil Test Date",{"$nulls":9},"Soil Test Units",{"$nulls":5},"Soil Test Phosphorus Method",{"$nulls":19},"Legume pasture","Ton",null,13,50,{"$nulls":12},"Sulfate of Potash - (0-0-50)",1,{"v":0,"d":"0%"},{"v":0,"d":"0%"},{"v":0.5,"d":"50%"},"lbs.",{"$nulls":3},{"v":0,"d":"0.00"},"","","","",{"$error":"#VALUE!"},{"$error":"#VALUE!"},{"$error":"#VALUE!"}]
[null,"Soil Test Lab",{"$nulls":10},"P",null,null,"K",null,null,"CEC",null,null,"Soil Test Comments",{"$nulls":15},"Legume-grass pasture","Ton",null,13,50,{"$nulls":12},"Urea - (46-0-0)",1,{"v":0.46,"d":"46%"},{"v":0,"d":"0%"},{"v":0,"d":"0%"},"lbs.",{"$nulls":3},{"v":0,"d":"0.00"},"","","","",{"$error":"#VALUE!"},{"$error":"#VALUE!"},{"$error":"#VALUE!"}]
[{"$nulls":37},"Legume-tall grass","Ton",null,13,50,{"$nulls":12},"AMS - 21-0-0-24S",1,{"v":0.21,"d":"21%"},{"v":0,"d":"0%"},{"v":0,"d":"0%"},"lbs."]
[{"$nulls":37},"Legume-tall grass seeding","Ton",null,13,50,null,"Manure Type",{"$nulls":10},"Liquid AMS - 8-0-0-9S",10.13,{"v":0.08,"d":"8%"},{"v":0,"d":"0%"},{"v":0,"d":"0%"},"gal."]
[null,"Crop Rotation, Yield, & Removal/Recommendation",{"$nulls":35},"Oats","Bu",null,0.25,0.19,null,"Solid","lb/ton","ton","ton/ac",{"$nulls":7},"MESZ® - 12-40-0",1,{"v":0.12,"d":"12%"},{"v":0.4,"d":"40%"},{"v":0,"d":"0%"},"lbs."]
[null,"Year",{"$nulls":4},"Crop",{"$nulls":5},"Average Yield",{"$nulls":5},"Removal / Recommendation",{"$nulls":18},"Rye","Bu",null,0.64,0.36,null,"Liquid","lb/1000 Gal","gal","gal/ac",{"$nulls":7},{"$f":"IF(ISBLANK(B38),\" \",B38)","v":" "},{"$f":"IF(BH16=\"gal.\", 11, 1)","v":1},{"$f":"IF($BH16=\"tons\",B$40,(B$40*0.01))","v":{"v":0,"d":"0%"}},{"$f":"IF($BH16=\"tons\",D$40,(D$40*0.01))","v":{"v":0,"d":"0%"}},{"$f":"IF($BH16=\"tons\",F$40,(F$40*0.01))","v":{"v":0,"d":"0%"}},{"$f":"IF(H38=\"lbs.\",\"lbs.\",IF(H38=\"gal.\",\"gal.\",IF(H38=\"lbs/ton\",\"tons\",\"\")))","v":""}]
[{"$nulls":18},"N*",null,null,"P2O5",null,null,"K2O",{"$nulls":12},"Small grain forage","Ton",null,13,50,{"$nulls":12},{"$f":"IF(ISBLANK(B41),\" \",B41)","v":" "},{"$f":"IF(BH17=\"gal.\", 11, 1)","v":1},{"$f":"IF($BH17=\"tons\",B$43,(B$43*0.01))","v":{"v":0,"d":"0%"}},{"$f":"IF($BH17=\"tons\",D$43,(D$43*0.01))","v":{"v":0,"d":"0%"}},{"$f":"IF($BH17=\"tons\",F$43,(F$43*0.01))","v":{"v":0,"d":"0%"}},{"$f":"IF(H41=\"lbs.\",\"lbs.\",IF(H41=\"gal.\",\"gal.\",IF(H41=\"lbs/ton\",\"tons\",\"\")))","v":""}]
[{"$nulls":16},{"$f":"IFERROR(VLOOKUP(G18,$AR$28:$AS$42,2,FALSE),\"\")","v":""},null,{"$f":"IFERROR(MAX(INDEX($AL$36:$AQ$36,MATCH(G18,AL$36:$AL$36,0),6),0),0)","v":0},null,null,{"$f":"IFERROR(INDEX($AR$27:$BN$42,MATCH(G18,$AR$27:$AR$42,0),MATCH($AN36,$AR$27:$BN$27,0)),0)","v":0},null,null,{"$f":"IF($AO$35>0,IFERROR(IF(INDEX($AR$27:$BN$42,MATCH(G18,$AR$27:$AR$42,0),MATCH($AO36,$AR$27:$BN$27,0))>300, 300,(INDEX($AR$27:$BN$42,MATCH(G18,$AR$27:$AR$42,0),MATCH($AO36,$AR$27:$BN$27,0)))),0),0)","v":0},{"$nulls":12},"Sorghum","Bu",null,0.22,0.22]
[null,{"$f":"IF(B18>2018,B18+1,\" \")","v":" "},{"$nulls":14},{"$f":"IFERROR(VLOOKUP(G19,$AR$28:$AS$42,2,FALSE),\"\")","v":""},null,{"$f":"IFERROR(MAX(INDEX($AL$37:$AQ$37,MATCH(G19,AL$37:$AL$37,0),6),0),0)","v":0},null,null,{"$f":"IFERROR(INDEX($AR$27:$BN$42,MATCH(G19,$AR$27:$AR$42,0),MATCH($AN37,$AR$27:$BN$27,0)),0)","v":0},null,null,{"$f":"IF($AO$35>0,IFERROR(IF(INDEX($AR$27:$BN$42,MATCH(G19,$AR$27:$AR$42,0),MATCH($AO37,$AR$27:$BN$27,0))>300, 300,(INDEX($AR$27:$BN$42,MATCH(G19,$AR$27:$AR$42,0),MATCH($AO37,$AR$27:$BN$27,0)))),0),0)","v":0},{"$nulls":12},"Sorghum-sudan forage","Ton",null,4.6,18,null,"Manure App Rate Multiplier"]
[null,{"$f":"IFERROR(IF(B19>2018,B19+1,\"\"),\"\")","v":""},{"$nulls":14},{"$f":"IFERROR(VLOOKUP(G20,$AR$28:$AS$42,2,FALSE),\"\")","v":""},null,{"$f":"IFERROR(MAX(INDEX($AL$38:$AQ$38,MATCH(G20,AL$38:$AL$38,0),6),0),0)","v":0},null,null,{"$f":"IFERROR(INDEX($AR$27:$BN$42,MATCH(G20,$AR$27:$AR$42,0),MATCH($AN38,$AR$27:$BN$27,0)),0)","v":0},null,null,0,{"$nulls":12},"Soybean","Bu",null,0.8,1.4,null,{"$f":"IF(Q38=\"Liquid\",1000,1)","v":1}]
[null,{"$f":"IFERROR(IF(B20>2018,B20+1,\"\"),\"\")","v":""},{"$nulls":14},{"$f":"IFERROR(VLOOKUP(G21,$AR$28:$AS$42,2,FALSE),\"\")","v":""},null,{"$f":"IFERROR(MAX(INDEX($AL$39:$AQ$39,MATCH(G21,AL$39:$AL$39,0),6),0),0)","v":0},null,null,{"$f":"IFERROR(INDEX($AR$27:$BN$42,MATCH(G21,$AR$27:$AR$42,0),MATCH($AN39,$AR$27:$BN$27,0)),0)","v":0},null,null,0,{"$nulls":12},"Spelt","Bu",null,0.63,0.37,null,"RoundDown Rate decimal Factor"]
[null,"Nutrient Application Plan",{"$nulls":11},"Nutrient Needs",{"$nulls":4},{"$f":"SUM(S18:U21)","v":0},null,null,{"$f":"SUM(V18:X21)","v":0},null,null,{"$f":"SUM(Y18:AA21)","v":0},{"$nulls":12},"Sugar beet","Ton",null,1.3,3.3,null,"Rate",null,"Field Total"]
[{"$nulls":13},"Nutrient Planned",{"$nulls":4},{"$f":"SUM(N26:O36)","v":0},null,null,{"$f":"SUM(P26:Q36)","v":0},null,null,{"$f":"SUM(R26:S36)","v":0},{"$nulls":12},"Tomato ","Ton",null,2.18,7,null,{"$f":"IF(Q38=\"Liquid\",-2,1)","v":1},null,{"$f":"IF(Q38=\"Liquid\",-2,0)","v":0}]
[null,"Target Crop",null,"Source",{"$nulls":4},"Rate - Pounds Recommended per Ac.",{"$nulls":10},"Time",{"$nulls":3},"Place",{"$nulls":13},"Wheat","Bu",null,0.63,0.37]
[{"$nulls":3},"Form",{"$nulls":4},"Rate",null,"Amount",null,null,"N*",null,"P2O5",null,"K2O",null,"Season",null,"Year",null,"Application Method",{"$nulls":13},"Wheat w/Stover","Bu",null,0.72,1.28]
[{"$nulls":12},{"$f":"IFERROR(INDEX(VFertList,MATCH(D26,$BC$2:$BC$17,0),6),\"\")","v":""},{"$f":"IFERROR(BQ2, \"0\")","v":"0"},null,{"$f":"IFERROR(BR2, \"0\")","v":"0"},null,{"$f":"IFERROR(BS2, \"0\")","v":"0"},{"$nulls":25},1,2,3,4,5,6,7,8,9,10,11,12,13,14,15,16,17,18,19,20,21,22,23,24]
[{"$nulls":12},{"$f":"IFERROR(INDEX(VFertList,MATCH(D27,$BC$2:$BC$17,0),6),\"\")","v":""},{"$f":"IFERROR(BQ3, \"0\")","v":"0"},null,{"$f":"IFERROR(BR3, \"0\")","v":"0"},null,{"$f":"IFERROR(BS3, \"0\")","v":"0"},{"$nulls":26},"Unit","YP","P","K","P Buildup","P Maintenance","P Drawdown","No Apply","K Buildup","K Maintenance","K Drawdown","P Critical Level","P Maintenance Top Level","P Maintenance Top Level","P Upper Level","K CL","K ML","K DL","K Divisor","N Credit","NRemoval","NRx","Max N"]
[{"$nulls":12},"","0",null,"0",null,"0",{"$nulls":25},"Alfalfa","Ton",{"$f":"INDEX(YP,MATCH($AR28,$AL$36:$AL$39,0),2)","v":{"$error":"#N/A"}},13,50,{"$f":"((($BD28-$AN$35)*5)+(AX28))","v":{"$error":"#VALUE!"}},{"$f":"AT28*AU28","v":{"$error":"#N/A"}},{"$f":"($AX28)-($AX28*($AN$35-($BD28+15))/10)","v":{"$error":"#N/A"}},0,{"$f":"(($BH28-$AO$35)*((1+(0.05*$AP$35)))+(AT28*AV28)+20)","v":{"$error":"#N/A"}},{"$f":"((AT28*AV28)+20)-(((AT28*AV28)+20)*($AO$35-BH28)/BK28)","v":{"$error":"#N/A"}},{"$f":"((AT28*AV28)+20)-(((AT28*AV28)+20)*($AO$35-BH28)/BK28)","v":{"$error":"#N/A"}},25,{"$f":"BD28+0.1","v":25.1},{"$f":"BD28+15","v":40},{"$f":"BD28+24.9","v":49.9},{"$f":"75+(2.5*$AP$35)","v":75},{"$f":"BH28+30","v":105},{"$f":"BH28+50","v":125},50,140,40,null,{"$f":"MIN((BM28*AT28),150)","v":{"$error":"#N/A"}}]
[{"$nulls":12},"","0",null,"0",null,"0",{"$nulls":25},"Barley","Bu",{"$error":"#N/A"},0.25,0.2,{"$f":"((($BD29-$AN$35)*5)+(AX29))","v":{"$error":"#VALUE!"}},{"$f":"AT29*AU29","v":{"$error":"#N/A"}},{"$f":"($AX29)-($AX29*($AN$35-($BD29+15))/10)","v":{"$error":"#N/A"}},0,{"$f":"(($BH29-$AO$35)*((1+(0.05*$AP$35)))+(AT29*AV29)+20)","v":{"$error":"#N/A"}},{"$f":"(AT29*AV29)+20","v":{"$error":"#N/A"}},{"$f":"((AT29*AV29)+20)-(((AT29*AV29)+20)*($AO$35-(BH29+30))/BK29)","v":{"$error":"#N/A"}},25,{"$f":"BD29+0.1","v":25.1},{"$f":"BD29+15","v":40},{"$f":"BD29+24.9","v":49.9},{"$f":"75+(2.5*$AP$35)","v":75},105,125,20,0,1,{"$f":"-27+(BM29*AT29)","v":{"$error":"#N/A"}},{"$f":"BN29","v":{"$error":"#N/A"}}]
[{"$nulls":12},"","0",null,"0",null,"0",{"$nulls":25},"Corn","Bu",{"$error":"#N/A"},0.37,0.27,{"$error":"#VALUE!"},{"$f":"AT30*AU30","v":{"$error":"#N/A"}},{"$f":"($AX30)-($AX30*($AN$35-($BD30+15))/10)","v":{"$error":"#N/A"}},0,{"$f":"(($BH30-$AO$35)*((1+(0.05*$AP$35)))+(AT30*AV30)+20)","v":{"$error":"#N/A"}},{"$f":"(AT30*AV30)+20","v":{"$error":"#N/A"}},{"$f":"((AT30*AV30)+20)-(((AT30*AV30)+20)*($AO$35-(BH30+30))/BK30)","v":{"$error":"#N/A"}},15,15.1,30,39.9,75,105,125,20,0,1.36,{"$error":"#N/A"},{"$error":"#N/A"}]
[{"$nulls":12},"","0",null,"0",null,"0",{"$nulls":25},"Corn silage","Ton",{"$error":"#N/A"},3.3,8,{"$error":"#VALUE!"},{"$error":"#N/A"},{"$error":"#N/A"},0,{"$error":"#N/A"},{"$f":"((AT31*AV31)+20)-(((AT31*AV31)+20)*($AO$35-BH31)/BK31)","v":{"$error":"#N/A"}},{"$f":"((AT31*AV31)+20)-(((AT31*AV31)+20)*($AO$35-BH31)/BK31)","v":{"$error":"#N/A"}},15,15.1,30,39.9,75,105,125,50,0,9.4,{"$error":"#N/A"},{"$error":"#N/A"}]
[{"$nulls":12},"","0",null,"0",null,"0",{"$nulls":25},"Grass pasture","Ton",{"$error":"#N/A"},13,50,{"$error":"#VALUE!"},{"$error":"#N/A"},{"$error":"#N/A"},0,{"$error":"#N/A"},{"$f":"((AT32*AV32)+20)-(((AT32*AV32)+20)*($AO$35-BH32)/BK32)","v":{"$error":"#N/A"}},{"$f":"((AT32*AV32)+20)-(((AT32*AV32)+20)*($AO$35-BH32)/BK32)","v":{"$error":"#N/A"}},25,25.1,40,49.9,75,105,125,50,40,40,{"$error":"#N/A"},{"$error":"#N/A"}]
[{"$nulls":12},"","0",null,"0",null,"0",{"$nulls":19},"Recommendations",{"$nulls":5},"Legume pasture","Ton",{"$error":"#N/A"},13,50,{"$error":"#VALUE!"},{"$error":"#N/A"},{"$error":"#N/A"},0,{"$error":"#N/A"},{"$f":"((AT33*AV33)+20)-(((AT33*AV33)+20)*($AO$35-BH33)/BK33)","v":{"$error":"#N/A"}},{"$f":"((AT33*AV33)+20)-(((AT33*AV33)+20)*($AO$35-BH33)/BK33)","v":{"$error":"#N/A"}},25,25.1,40,49.9,75,105,125,50,100,40,{"$error":"#N/A"},{"$error":"#N/A"}]
[{"$nulls":12},"","0",null,"0",null,"0",{"$nulls":21},"P","K","CEC","N Rec","Oats","Bu",{"$error":"#N/A"},0.25,0.19,{"$error":"#VALUE!"},{"$error":"#N/A"},{"$error":"#N/A"},0,{"$error":"#N/A"},{"$f":"(AT34*AV34)+20","v":{"$error":"#N/A"}},{"$f":"((AT34*AV34)+20)-(((AT34*AV34)+20)*($AO$35-(BH34+30))/BK34)","v":{"$error":"#N/A"}},25,25.1,40,49.9,75,105,125,20,0,0.7,{"$error":"#N/A"},{"$error":"#N/A"}]
[{"$nulls":12},"","0",null,"0",null,"0",{"$nulls":21},{"$f":"IFERROR(IF(AND($X$11=\"Bray P1\",$O$11=\"ppm\"),$M$13,IF(AND($X$11=\"Bray P1\",$O$11=\"lb/ac\"),($M$13/2),IF(AND($X$11=\"Mehlich III\",$O$11=\"ppm\"),INDEX(Conversion,MATCH((ROUND($M$13,0)),$AN$45:AN284,0),1),INDEX(Conversion,MATCH(ROUND($M$13/2,0),$AN$45:AN284,0),1)))),IF(M13>0,1,\"\"))","v":""},{"$f":"IF(O11=\"ppm\",P13,P13/2)","v":0},{"$f":"S13","v":0},null,"Rye","Bu",{"$error":"#N/A"},0.64,0.36,{"$error":"#VALUE!"},{"$error":"#N/A"},{"$error":"#N/A"},0,{"$error":"#N/A"},{"$f":"(AT35*AV35)+20","v":{"$error":"#N/A"}},{"$f":"((AT35*AV35)+20)-(((AT35*AV35)+20)*($AO$35-(BH35+30))/BK35)","v":{"$error":"#N/A"}},25,25.1,40,49.9,75,105,125,20,0,1.3,{"$f":"40+(1.75*(AT35-50))","v":{"$error":"#N/A"}},{"$error":"#N/A"}]
[{"$nulls":12},"","0",null,"0",null,{"$f":"IFERROR(BS12, \"0\")","v":"0"},{"$nulls":19},{"$f":"G18","v":0},{"$f":"M18","v":0},{"$f":"IF($AN$35<=VLOOKUP($AL36,Reference,13),\"P Buildup\",IF(AND($AN$35>=VLOOKUP($AL36,Reference,14),$AN$35<=VLOOKUP($AL36,Reference,15)),\"P Maintenance\",IF(AND($AN$35>VLOOKUP($AL36,Reference,15),($AN$35<VLOOKUP($AL36,Reference,16))),\"P Drawdown\", \"No Apply\")))","v":{"$error":"#N/A"}},{"$f":"IF($AO$35>=VLOOKUP($AL36,Reference,19),\"No Apply\",IF($AO$35<=VLOOKUP($AL36,Reference,17), \"K Buildup\", IF(AND($AO$35>=VLOOKUP($AL36,Reference,17),($AO$35<=(VLOOKUP($AL36,Reference,18)-0.1))), \"K Maintenance\", \"K Drawdown\")))","v":{"$error":"#N/A"}},{"$f":"IFERROR(IF(OR($AL36=\"Wheat\",$AL36=\"Wheat w/ Stover\",$AL36=\"Rye\",$AL36=\"Spelt\",AND(AL35=\"Soybean\")),INDEX($AR$28:$BN$42,MATCH($AL35,Crop,0),21),0),0)","v":0},{"$f":"(INDEX($AR$28:$BN$42,MATCH(AL36,Crop,0),23))-AP36","v":{"$error":"#N/A"}},"Sorghum","Bu",{"$error":"#N/A"},0.22,0.22,{"$error":"#VALUE!"},{"$error":"#N/A"},{"$error":"#N/A"},0,{"$error":"#N/A"},{"$f":"(AT36*AV36)+20","v":{"$error":"#N/A"}},{"$f":"((AT36*AV36)+20)-(((AT36*AV36)+20)*($AO$35-(BH36+30))/BK36)","v":{"$error":"#N/A"}},15,15.1,30,39.9,75,105,125,20,0,0.7,{"$f":"-27+(BM36*AT36)","v":{"$error":"#N/A"}},{"$error":"#N/A"}]
[null,"Custom Fertilizer",{"$nulls":7},"Product Summary",{"$nulls":21},{"$f":"INDEX($D$26:$D$36,MATCH(0,COUNTIF($J$38:$J38,$D$26:$D$36),0),1)","v":0},{"$f":"SUM(SUMIFS($K$26:$K$36,$D$26:$D$36,$AF37,$V$26:$V$36,$O$38, $T$26:$T$36, \"Spring\"),SUMIFS($K$26:$K$36,$D$26:$D$36,$AF37,$V$26:$V$36,$O$38, $T$26:$T$36, \"Summer\"),SUMIFS($K$26:$K$36,$D$26:$D$36,$AF37,$V$26:$V$36,($O$38-1), $T$26:$T$36, \"Fall\"))*$S$8","v":0},{"$f":"SUM(SUMIFS($K$26:$K$36,$D$26:$D$36,$AF37,$V$26:$V$36,$R$38, $T$26:$T$36, \"Spring\"),SUMIFS($K$26:$K$36,$D$26:$D$36,$AF37,$V$26:$V$36,$R$38, $T$26:$T$36, \"Summer\"), SUMIFS($K$26:$K$36,$D$26:$D$36,$AF37,$V$26:$V$36,($R$38-1), $T$26:$T$36, \"Fall\"))*$S$8","v":0},{"$f":"SUM(SUMIFS($K$26:$K$36,$D$26:$D$36,$AF37,$V$26:$V$36,$U$38, $T$26:$T$36, \"Spring\"),SUMIFS($K$26:$K$36,$D$26:$D$36,$AF37,$V$26:$V$36,$U$38, $T$26:$T$36, \"Summer\"), SUMIFS($K$26:$K$36,$D$26:$D$36,$AF37,$V$26:$V$36,($U$38-1), $T$26:$T$36, \"Fall\"))*$S$8","v":0},{"$f":"SUM(SUMIFS($K$26:$K$36,$D$26:$D$36,$AF37,$V$26:$V$36,$X$38, $T$26:$T$36, \"Spring\"),SUMIFS($K$26:$K$36,$D$26:$D$36,$AF37,$V$26:$V$36,$X$38, $T$26:$T$36, \"Summer\"), SUMIFS($K$26:$K$36,$D$26:$D$36,$AF37,$V$26:$V$36,($X$38-1), $T$26:$T$36, \"Fall\"))*$S$8","v":0},{"$f":"INDEX($BC$3:$BH$17,MATCH($J39,$BC$3:$BC$17,0),6)","v":{"$error":"#N/A"}},{"$f":"G19","v":0},{"$f":"M19","v":0},{"$f":"IF($AN$35<=VLOOKUP($AL37,Reference,13),\"P Buildup\",IF(AND($AN$35>=VLOOKUP($AL37,Reference,14),$AN$35<=VLOOKUP($AL37,Reference,15)),\"P Maintenance\",IF(AND($AN$35>VLOOKUP($AL37,Reference,15),($AN$35<VLOOKUP($AL37,Reference,16))),\"P Drawdown\", \"No Apply\")))","v":{"$error":"#N/A"}},{"$f":"IF($AO$35>=VLOOKUP($AL37,Reference,19),\"No Apply\",IF($AO$35<=VLOOKUP($AL37,Reference,17), \"K Buildup\", IF(AND($AO$35>=VLOOKUP($AL37,Reference,17),($AO$35<=(VLOOKUP($AL37,Reference,18)-0.1))), \"K Maintenance\", \"K Drawdown\")))","v":{"$error":"#N/A"}},{"$f":"IFERROR(IF(OR($AL37=\"Wheat\",$AL37=\"Wheat w/ Stover\",$AL37=\"Rye\",$AL37=\"Spelt\",AND(AL36=\"Soybean\")),INDEX($AR$28:$BN$42,MATCH($AL36,Crop,0),21),0),0)","v":0},{"$f":"(INDEX($AR$28:$BN$42,MATCH(AL37,Crop,0),23))-AP37","v":{"$error":"#N/A"}},"Sorghum-sudan forage","Ton",{"$error":"#N/A"},4.6,18,{"$error":"#VALUE!"},{"$error":"#N/A"},{"$error":"#N/A"},0,{"$error":"#N/A"},{"$f":"((AT37*AV37)+20)-(((AT37*AV37)+20)*($AO$35-BH37)/BK37)","v":{"$error":"#N/A"}},{"$f":"((AT37*AV37)+20)-(((AT37*AV37)+20)*($AO$35-BH37)/BK37)","v":{"$error":"#N/A"}},25,25.1,40,49.9,75,105,125,50,0,40,{"$f":"-27+(BM37*AT37)","v":{"$error":"#N/A"}},{"$error":"#N/A"}]
[{"$nulls":9},"Fertilizer ",{"$nulls":4},{"$f":"IFERROR(IF(B18>2018,B18,\"\"),\"\")","v":""},null,null,{"$f":"B19","v":" "},null,null,{"$f":"B20","v":""},null,null,{"$f":"B21","v":""},null,null,"Unit",{"$nulls":4},{"$f":"INDEX($D$26:$D$36,MATCH(0,COUNTIF($J$38:$J39,$D$26:$D$36),0),1)","v":{"$error":"#N/A"}},{"$f":"SUM(SUMIFS($K$26:$K$36,$D$26:$D$36,$AF38,$V$26:$V$36,$O$38, $T$26:$T$36, \"Spring\"),SUMIFS($K$26:$K$36,$D$26:$D$36,$AF38,$V$26:$V$36,$O$38, $T$26:$T$36, \"Summer\"), SUMIFS($K$26:$K$36,$D$26:$D$36,$AF38,$V$26:$V$36,($O$38-1), $T$26:$T$36, \"Fall\"))*$S$8","v":0},0,0,0,{"$f":"INDEX($BC$3:$BH$17,MATCH($J40,$BC$3:$BC$17,0),6)","v":{"$error":"#N/A"}},{"$f":"G20","v":0},{"$f":"M20","v":0},{"$f":"IF($AN$35<=VLOOKUP($AL38,Reference,13),\"P Buildup\",IF(AND($AN$35>=VLOOKUP($AL38,Reference,14),$AN$35<=VLOOKUP($AL38,Reference,15)),\"P Maintenance\",IF(AND($AN$35>VLOOKUP($AL38,Reference,15),($AN$35<VLOOKUP($AL38,Reference,16))),\"P Drawdown\", \"No Apply\")))","v":{"$error":"#N/A"}},{"$f":"IF($AO$35>=VLOOKUP($AL38,Reference,19),\"No Apply\",IF($AO$35<=VLOOKUP($AL38,Reference,17), \"K Buildup\", IF(AND($AO$35>=VLOOKUP($AL38,Reference,17),($AO$35<=(VLOOKUP($AL38,Reference,18)-0.1))), \"K Maintenance\", \"K Drawdown\")))","v":{"$error":"#N/A"}},{"$f":"IFERROR(IF(OR($AL38=\"Wheat\",$AL38=\"Wheat w/ Stover\",$AL38=\"Rye\",$AL38=\"Spelt\",AND(AL37=\"Soybean\")),INDEX($AR$28:$BN$42,MATCH($AL37,Crop,0),21),0),0)","v":0},{"$f":"(INDEX($AR$28:$BN$42,MATCH(AL38,Crop,0),23))-AP38","v":{"$error":"#N/A"}},"Soybean","Bu",{"$error":"#N/A"},0.8,1.4,{"$error":"#VALUE!"},{"$error":"#N/A"},{"$error":"#N/A"},0,{"$error":"#N/A"},{"$f":"((AT38*AV38)+20)","v":{"$error":"#N/A"}},{"$f":"((AT38*AV38)+20)-(((AT38*AV38)+20)*($AO$35-(BH38+30))/BK38)","v":{"$error":"#N/A"}},15,15.1,30,39.9,75,105,125,20,30,3.8,null,{"$f":"MIN((BM38*AT38),150)","v":{"$error":"#N/A"}}]
[null,"N",null,"P",null,"K",null,"Units",null,{"$f":"IFERROR($AF37,\"\")","v":0},{"$nulls":4},{"$f":"IFERROR(IF($AK37=\"tons\",(AG37),AG37),\"\")","v":""},null,null,{"$f":"IFERROR(IF($AK37=\"tons\",(AH37),AH37),\"\")","v":""},null,null,{"$f":"IFERROR(IF($AK37=\"tons\",($AI37),$AI37),\"\")","v":""},null,null,{"$f":"IFERROR(IF($AK37=\"tons\",(AJ37),AJ37),\"\")","v":""},null,null,{"$f":"IFERROR(AK37,\"\")","v":""},{"$nulls":4},{"$f":"INDEX($D$26:$D$36,MATCH(0,COUNTIF($J$38:$J40,$D$26:$D$36),0),1)","v":{"$error":"#N/A"}},{"$f":"SUM(SUMIFS($K$26:$K$36,$D$26:$D$36,$AF39,$V$26:$V$36,$O$38, $T$26:$T$36, \"Spring\"),SUMIFS($K$26:$K$36,$D$26:$D$36,$AF39,$V$26:$V$36,$O$38, $T$26:$T$36, \"Summer\"), SUMIFS($K$26:$K$36,$D$26:$D$36,$AF39,$V$26:$V$36,($O$38-1), $T$26:$T$36, \"Fall\"))*$S$8","v":0},0,0,0,{"$error":"#N/A"},{"$f":"G21","v":0},{"$f":"M21","v":0},{"$f":"IF($AN$35<=VLOOKUP($AL39,Reference,13),\"P Buildup\",IF(AND($AN$35>=VLOOKUP($AL39,Reference,14),$AN$35<=VLOOKUP($AL39,Reference,15)),\"P Maintenance\",IF(AND($AN$35>VLOOKUP($AL39,Reference,15),($AN$35<VLOOKUP($AL39,Reference,16))),\"P Drawdown\", \"No Apply\")))","v":{"$error":"#N/A"}},{"$f":"IF($AO$35>=VLOOKUP($AL39,Reference,19),\"No Apply\",IF($AO$35<=VLOOKUP($AL39,Reference,17), \"K Buildup\", IF(AND($AO$35>=VLOOKUP($AL39,Reference,17),($AO$35<=(VLOOKUP($AL39,Reference,18)-0.1))), \"K Maintenance\", \"K Drawdown\")))","v":{"$error":"#N/A"}},{"$f":"IFERROR(IF(OR($AL39=\"Wheat\",$AL39=\"Wheat w/ Stover\",$AL39=\"Rye\",$AL39=\"Spelt\",AND(AL38=\"Soybean\")),INDEX($AR$28:$BN$42,MATCH($AL38,Crop,0),21),0),0)","v":0},{"$f":"(INDEX($AR$28:$BN$42,MATCH(AL39,Crop,0),23))-AP39","v":{"$error":"#N/A"}},"Spelt","Bu",{"$f":"INDEX(YP,MATCH($AR39,$AL$36:$AL$39,0),2)","v":{"$error":"#N/A"}},0.63,0.37,{"$error":"#VALUE!"},{"$error":"#N/A"},{"$error":"#N/A"},0,{"$error":"#N/A"},{"$f":"((AT39*AV39)+20)","v":{"$error":"#N/A"}},{"$f":"((AT39*AV39)+20)-(((AT39*AV39)+20)*($AO$35-(BH39+30))/BK39)","v":{"$error":"#N/A"}},25,25.1,40,{"$f":"BD39+24.9","v":49.9},75,105,125,20,0,1.3,{"$f":"-27+(BM39*AT39)","v":{"$error":"#N/A"}},{"$f":"BN39","v":{"$error":"#N/A"}}]
[{"$nulls":9},"",{"$nulls":4},{"$f":"IFERROR(IF($AK38=\"tons\",(AG38),AG38),\"\")","v":""},null,null,{"$f":"IFERROR(IF($AK38=\"tons\",(AH38),AH38),\"\")","v":""},null,null,{"$f":"IFERROR(IF($AK38=\"tons\",($AI38),$AI38),\"\")","v":""},null,null,{"$f":"IFERROR(IF($AK38=\"tons\",(AJ38),AJ38),\"\")","v":""},null,null,"",{"$nulls":4},{"$f":"INDEX($D$26:$D$36,MATCH(0,COUNTIF($J$38:$J41,$D$26:$D$36),0),1)","v":{"$error":"#N/A"}},0,0,0,0,{"$error":"#N/A"},{"$nulls":4},"N Credit",null,"Tomato ","Ton",{"$f":"INDEX(YP,MATCH($AR40,$AL$36:$AL$39,0),2)","v":{"$error":"#N/A"}},2.18,7,{"$f":"((($BD40-$AN$35)*5)+(AX40))","v":{"$error":"#VALUE!"}},{"$f":"AT40*AU40","v":{"$error":"#N/A"}},{"$f":"($AX40)-($AX40*($AN$35-($BD40+15))/10)","v":{"$error":"#N/A"}},0,{"$f":"(($BH40-$AO$35)*((1+(0.05*$AP$35)))+(AT40*AV40)+20)","v":{"$error":"#N/A"}},{"$f":"((AT40*AV40)+20)","v":{"$error":"#N/A"}},{"$f":"((AT40*AV40)+20)-(((AT40*AV40)+20)*($AO$35-(BH40+30))/BK40)","v":{"$error":"#N/A"}},45,45.1,80,80.1,{"$f":"75+(2.5*$AP$35)","v":75},{"$f":"BH40+30","v":105},{"$f":"BH40+50","v":125},20,0,null,80]
[{"$nulls":9},"",{"$nulls":4},"",null,null,"",null,null,"",null,null,"",null,null,"",{"$nulls":4},{"$f":"INDEX($D$26:$D$36,MATCH(0,COUNTIF($J$38:$J42,$D$26:$D$36),0),1)","v":{"$error":"#N/A"}},0,0,0,0,{"$error":"#N/A"},{"$nulls":6},"Wheat","Bu",{"$error":"#N/A"},0.63,0.37,{"$error":"#VALUE!"},{"$f":"AT41*AU41","v":{"$error":"#N/A"}},{"$error":"#N/A"},0,{"$error":"#N/A"},{"$f":"(AT41*AV41)+20","v":{"$error":"#N/A"}},{"$f":"((AT41*AV41)+20)-(((AT41*AV41)+20)*($AO$35-(BH41+30))/BK41)","v":{"$error":"#N/A"}},25,25.1,40,49.9,75,105,125,20,0,1.3,{"$f":"40+(1.75*(AT41-50))","v":{"$error":"#N/A"}},{"$f":"BN41","v":{"$error":"#N/A"}}]
[null,"N",null,"P",null,"K",null,"Units",null,{"$f":"IFERROR($AF40,\"\")","v":""},{"$nulls":4},"",null,null,"",null,null,"",null,null,"",null,null,"",{"$nulls":4},{"$f":"INDEX($D$26:$D$36,MATCH(0,COUNTIF($J$38:$J43,$D$26:$D$36),0),1)","v":{"$error":"#N/A"}},0,0,0,0,{"$error":"#N/A"},{"$nulls":6},{"$f":"AL25","v":"Wheat w/Stover"},"Bu",{"$error":"#N/A"},0.72,1.28,{"$error":"#VALUE!"},{"$f":"AT42*AU42","v":{"$error":"#N/A"}},{"$error":"#N/A"},0,{"$error":"#N/A"},{"$f":"(AT42*AV42)+20","v":{"$error":"#N/A"}},{"$f":"((AT42*AV42)+20)-(((AT42*AV42)+20)*($AO$35-(BH42+30))/BK42)","v":{"$error":"#N/A"}},25,25.1,40,49.9,75,105,125,20,0,1.3,{"$f":"40+(1.75*(AT42-50))","v":{"$error":"#N/A"}},{"$f":"BN42","v":{"$error":"#N/A"}}]
[{"$nulls":9},{"$f":"IFERROR($AF41,\"\")","v":""},{"$nulls":4},"",null,null,"",null,null,"",null,null,"",null,null,"",{"$nulls":4},{"$f":"INDEX($D$26:$D$36,MATCH(0,COUNTIF($J$38:$J44,$D$26:$D$36),0),1)","v":{"$error":"#N/A"}},0,0,0,0,{"$error":"#N/A"},"Soil Test Conversion"]
[null,"Plan Writer",{"$nulls":4},"Date",null,null,"",{"$nulls":4},"",null,null,"",null,null,"",null,null,"",null,null,"",{"$nulls":4},{"$f":"INDEX($D$26:$D$36,MATCH(0,COUNTIF($J$38:$J45,$D$26:$D$36),0),1)","v":{"$error":"#N/A"}},0,0,0,0,{"$error":"#N/A"},"P1PPM","P1LB","M3PPM","M3LB"]
[{"$nulls":9},"",{"$nulls":4},"",null,null,"",null,null,"",null,null,"",null,null,"",{"$nulls":4},{"$f":"INDEX($D$26:$D$36,MATCH(0,COUNTIF($J$38:$J46,$D$26:$D$36),0),1)","v":{"$error":"#N/A"}},0,0,0,0,{"$error":"#N/A"},1,{"$f":"AL45*2","v":2},11,{"$f":"AN45*2","v":22}]
[{"$nulls":9},"",{"$nulls":4},"",null,null,"",null,null,"",null,null,"",null,null,"",{"$nulls":4},{"$f":"INDEX($D$26:$D$36,MATCH(0,COUNTIF($J$38:$J50,$D$26:$D$36),0),1)","v":{"$error":"#N/A"}},0,0,0,0,{"$error":"#N/A"},2,{"$f":"AL46*2","v":4},12,{"$f":"AN46*2","v":24}]
[null,"Notes",{"$nulls":35},3,6,13,26]
[{"$nulls":37},4,8,14,28]
[{"$nulls":37},4,8,15,30]
[{"$nulls":37},5,10,16,32]
[null,{"$f":"S8","v":{"v":0,"d":"0.0"}},"Was the ground frozen or snow covered? (For Surface Application Only)",{"$nulls":34},6,12,17,34]
[{"$nulls":37},7,14,18,36]
[{"$nulls":37},8,16,19,38]
[{"$nulls":37},9,18,20,40]
[{"$nulls":37},9,18,21,42]
[{"$nulls":37},10,20,22,44]
[null,null,"Weather forecast for next 12 & 24 Hours",{"$nulls":34},11,22,23,46]
[{"$nulls":37},12,24,24,48]
[{"$nulls":37},13,26,25,50]
[{"$nulls":37},14,28,26,52]
[{"$nulls":37},14,28,27,54]
[null,null,"Weather conditions, temp., precipitation at time of application",{"$nulls":34},15,30,28,56]
[{"$nulls":37},16,32,29,58]
[{"$nulls":37},17,34,30,60]
[{"$nulls":37},18,36,31,62]
[{"$nulls":37},19,38,32,64]
[null,null,"Application method",{"$nulls":34},19,38,33,66]
[{"$nulls":37},20,40,34,68]
[{"$nulls":37},21,42,35,70]
[{"$nulls":37},22,44,36,72]
[null,null,"Soil conditions at time of application",{"$nulls":34},23,46,37,74]
[{"$nulls":37},24,48,38,76]
[{"$nulls":37},24,48,39,78]
[{"$nulls":37},25,50,40,80]
[null,null,"Name of Certificate Holder",{"$nulls":34},26,52,41,82]
[{"$nulls":37},27,54,42,84]
[{"$nulls":37},28,56,43,86]
[{"$nulls":37},29,58,44,88]
[null,null,"Name of applicator",{"$nulls":34},29,58,45,90]
[{"$nulls":37},30,60,46,92]
[{"$nulls":37},31,62,47,94]
[{"$nulls":37},32,64,48,96]
[null,null,"Fertilizer analysis and total amount",{"$nulls":34},33,66,49,98]
[{"$nulls":37},34,68,50,100]
[{"$nulls":37},34,68,51,102]
[{"$nulls":37},35,70,52,104]
[null,"Application Record for:","Rate & acres of application",{"$nulls":34},36,72,53,106]
[{"$nulls":37},37,74,54,108]
[{"$nulls":37},38,76,55,110]
[{"$nulls":37},39,78,56,112]
[null,null,"Date of application",{"$nulls":34},39,78,57,114]
[{"$nulls":37},40,80,58,116]
[{"$nulls":37},41,82,59,118]
[{"$nulls":37},42,84,60,120]
[{"$nulls":37},43,86,61,122]
[{"$nulls":37},44,88,62,124]
[{"$nulls":37},44,88,63,126]
[{"$nulls":37},45,90,64,128]
[{"$nulls":37},46,92,65,130]
[{"$nulls":37},47,94,66,132]
[{"$nulls":37},48,96,67,134]
[{"$nulls":37},48,96,68,136]
[{"$nulls":37},49,98,69,138]
[{"$nulls":37},50,100,70,140]
[{"$nulls":37},51,102,71,142]
[{"$nulls":37},52,104,72,144]
[{"$nulls":37},53,106,73,146]
[{"$nulls":37},53,106,74,148]
[{"$nulls":37},54,108,75,150]
[{"$nulls":37},55,{"$f":"AL110*2","v":110},76,{"$f":"AN110*2","v":152}]
[{"$nulls":37},56,112,77,154]
[{"$nulls":37},57,114,78,156]
[{"$nulls":37},58,116,79,158]
[{"$nulls":37},58,116,80,160]
[{"$nulls":37},59,118,81,162]
[{"$nulls":37},60,120,82,164]
[{"$nulls":37},61,122,83,166]
[{"$nulls":37},62,124,84,168]
[{"$nulls":37},63,126,85,170]
[{"$nulls":37},63,126,86,172]
[{"$nulls":37},64,128,87,174]
[{"$nulls":37},65,130,88,176]
[{"$nulls":37},66,132,89,178]
[{"$nulls":37},67,134,90,180]
[{"$nulls":37},68,136,91,182]
[{"$nulls":37},68,136,92,184]
[{"$nulls":37},69,138,93,186]
[{"$nulls":37},70,140,94,188]
[{"$nulls":37},71,142,95,190]
[{"$nulls":37},72,144,96,192]
[{"$nulls":37},73,146,97,194]
[{"$nulls":37},73,146,98,196]
[{"$nulls":37},74,148,99,198]
[{"$nulls":37},75,150,100,200]
[{"$nulls":37},76,152,101,202]
[{"$nulls":37},77,154,102,204]
[{"$nulls":37},78,156,103,206]
[{"$nulls":37},78,156,104,208]
[{"$nulls":37},79,158,105,210]
[{"$nulls":37},80,160,106,212]
[{"$nulls":37},81,162,107,214]
[{"$nulls":37},82,164,108,216]
[{"$nulls":37},83,166,109,218]
[{"$nulls":37},83,166,110,220]
[{"$nulls":37},84,168,111,222]
[{"$nulls":37},85,170,112,224]
[{"$nulls":37},86,172,113,226]
[{"$nulls":37},87,174,114,228]
[{"$nulls":37},88,176,115,230]
[{"$nulls":37},88,176,116,232]
[{"$nulls":37},89,178,117,234]
[{"$nulls":37},90,180,118,236]
[{"$nulls":37},91,182,119,238]
[{"$nulls":37},92,184,120,240]
[{"$nulls":37},93,186,121,242]
[{"$nulls":37},93,186,122,244]
[{"$nulls":37},94,188,123,246]
[{"$nulls":37},95,190,124,248]
[{"$nulls":37},96,192,125,250]
[{"$nulls":37},97,194,126,252]
[{"$nulls":37},98,196,127,254]
[{"$nulls":37},98,196,128,256]
[{"$nulls":37},99,198,129,258]
[{"$nulls":37},100,200,130,260]
[{"$nulls":37},101,202,131,262]
[{"$nulls":37},102,204,132,264]
[{"$nulls":37},103,206,133,266]
[{"$nulls":37},103,206,134,268]
[{"$nulls":37},104,208,135,270]
[{"$nulls":37},105,210,136,272]
[{"$nulls":37},106,212,137,274]
[{"$nulls":37},107,214,138,276]
[{"$nulls":37},108,216,139,278]
[{"$nulls":37},108,{"$f":"AL174*2","v":216},140,{"$f":"AN174*2","v":280}]
[{"$nulls":37},109,218,141,282]
[{"$nulls":37},110,220,142,284]
[{"$nulls":37},111,222,143,286]
[{"$nulls":37},112,224,144,288]
[{"$nulls":37},113,226,145,290]
[{"$nulls":37},113,226,146,292]
[{"$nulls":37},114,228,147,294]
[{"$nulls":37},115,230,148,296]
[{"$nulls":37},116,232,149,298]
[{"$nulls":37},117,234,150,300]
[{"$nulls":37},118,236,151,302]
[{"$nulls":37},118,236,152,304]
[{"$nulls":37},119,238,153,306]
[{"$nulls":37},120,240,154,308]
[{"$nulls":37},121,242,155,310]
[{"$nulls":37},122,244,156,312]
[{"$nulls":37},123,246,157,314]
[{"$nulls":37},123,246,158,316]
[{"$nulls":37},124,248,159,318]
[{"$nulls":37},125,250,160,320]
[{"$nulls":37},126,252,161,322]
[{"$nulls":37},127,254,162,324]
[{"$nulls":37},128,256,163,326]
[{"$nulls":37},128,256,164,328]
[{"$nulls":37},129,258,165,330]
[{"$nulls":37},130,260,166,332]
[{"$nulls":37},131,262,167,334]
[{"$nulls":37},132,264,168,336]
[{"$nulls":37},133,266,169,338]
[{"$nulls":37},133,266,170,340]
[{"$nulls":37},134,268,171,342]
[{"$nulls":37},135,270,172,344]
[{"$nulls":37},136,272,173,346]
[{"$nulls":37},137,274,174,348]
[{"$nulls":37},138,276,175,350]
[{"$nulls":37},138,276,176,352]
[{"$nulls":37},139,278,177,354]
[{"$nulls":37},140,280,178,356]
[{"$nulls":37},141,282,179,358]
[{"$nulls":37},142,284,180,360]
[{"$nulls":37},143,286,181,362]
[{"$nulls":37},143,286,182,364]
[{"$nulls":37},144,288,183,366]
[{"$nulls":37},145,290,184,368]
[{"$nulls":37},146,292,185,370]
[{"$nulls":37},147,294,186,372]
[{"$nulls":37},148,296,187,374]
[{"$nulls":37},148,296,188,376]
[{"$nulls":37},149,298,189,378]
[{"$nulls":37},150,300,190,380]
[{"$nulls":37},151,302,191,382]
[{"$nulls":37},152,304,192,384]
[{"$nulls":37},152,304,193,386]
[{"$nulls":37},153,306,194,388]
[{"$nulls":37},154,308,195,390]
[{"$nulls":37},155,310,196,392]
[{"$nulls":37},156,312,197,394]
[{"$nulls":37},157,314,198,396]
[{"$nulls":37},157,314,199,398]
[{"$nulls":37},158,316,200,400]
[{"$nulls":37},159,318,201,402]
[{"$nulls":37},160,320,202,404]
[{"$nulls":37},161,322,203,406]
[{"$nulls":37},162,{"$f":"AL238*2","v":324},204,{"$f":"AN238*2","v":408}]
[{"$nulls":37},162,324,205,410]
[{"$nulls":37},163,326,206,412]
[{"$nulls":37},164,328,207,414]
[{"$nulls":37},165,330,208,416]
[{"$nulls":37},166,332,209,418]
[{"$nulls":37},167,334,210,420]
[{"$nulls":37},167,334,211,422]
[{"$nulls":37},168,336,212,424]
[{"$nulls":37},169,338,213,426]
[{"$nulls":37},170,340,214,428]
[{"$nulls":37},171,342,215,430]
[{"$nulls":37},172,344,216,432]
[{"$nulls":37},172,344,217,434]
[{"$nulls":37},173,346,218,436]
[{"$nulls":37},174,348,219,438]
[{"$nulls":37},175,350,220,440]
[{"$nulls":37},176,352,221,442]
[{"$nulls":37},177,354,222,444]
[{"$nulls":37},177,354,223,446]
[{"$nulls":37},178,356,224,448]
[{"$nulls":37},179,358,225,450]
[{"$nulls":37},180,360,226,452]
[{"$nulls":37},181,362,227,454]
[{"$nulls":37},182,364,228,456]
[{"$nulls":37},182,364,229,458]
[{"$nulls":37},183,366,230,460]
[{"$nulls":37},184,368,231,462]
[{"$nulls":37},185,370,232,464]
[{"$nulls":37},186,372,233,466]
[{"$nulls":37},187,374,234,468]
[{"$nulls":37},187,374,235,470]
[{"$nulls":37},188,376,236,472]
[{"$nulls":37},189,378,237,474]
[{"$nulls":37},190,380,238,476]
[{"$nulls":37},191,382,239,478]
[{"$nulls":37},192,384,240,480]
[{"$nulls":37},192,384,241,482]
[{"$nulls":37},193,386,242,484]
[{"$nulls":37},194,388,243,486]
[{"$nulls":37},195,390,244,488]
[{"$nulls":37},196,392,245,490]
[{"$nulls":37},197,394,246,492]
[{"$nulls":37},197,394,247,494]
[{"$nulls":37},198,396,248,496]
[{"$nulls":37},199,398,249,498]
[{"$nulls":37},200,400,250,500]

{"sheet":"VRT Review Tool","index":4,"n_rows":284,"n_cols":74,"rows_kept":284,"hidden":true,"merged":[[0,0,1,2],[0,3,1,13],[0,14,1,16],[0,17,1,31],[0,38,0,42],[0,44,0,45],[0,47,0,52],[1,47,1,50],[2,0,2,31],[3,0,3,2],[3,3,3,13],[3,14,3,18],[3,19,3,31],[4,0,4,2],[4,3,4,6],[4,7,4,9],[4,10,4,13],[4,14,4,16],[4,17,4,18],[4,19,4,20],[4,21,4,23],[4,24,4,31],[5,0,5,31],[5,44,6,45],[6,0,6,3],[6,4,6,8],[6,9,6,12],[6,13,6,26],[6,27,8,31],[7,0,8,3],[7,4,8,8],[7,9,7,12],[7,13,7,14],[7,15,7,18],[7,19,7,20],[7,21,7,24],[7,25,7,26],[8,9,8,10],[8,11,8,12],[8,13,8,14],[8,15,8,16],[8,17,8,18],[8,19,8,20],[8,21,8,22],[8,23,8,24],[8,25,8,26],[9,0,10,3],[9,4,10,8],[9,9,10,10],[9,11,10,12],[9,13,10,14],[9,15,10,16],[9,17,10,18],[9,19,10,20],[9,21,10,22],[9,23,10,24],[9,25,10,26],[9,27,11,31],[11,0,11,2],[11,3,11,5],[11,6,11,8],[11,9,11,10],[11,11,11,26],[12,0,12,2],[12,3,12,5],[12,6,12,7],[12,9,12,10],[12,11,12,12],[12,13,12,14],[12,17,12,18],[12,19,12,20],[12,21,15,22],[12,23,12,24],[12,25,12,26],[12,27,13,31],[13,0,13,2],[13,3,13,5],[13,6,13,7],[13,9,13,10],[13,11,13,12],[13,13,13,14],[13,17,13,18],[13,19,13,20],[13,23,13,24],[13,25,13,26],[14,0,14,2],[14,3,14,5],[14,6,14,7],[14,9,14,10],[14,11,14,12],[14,13,14,14],[14,17,14,18],[14,19,14,20],[14,23,14,24],[14,25,14,26],[14,27,15,31],[15,0,15,2],[15,3,15,5],[15,6,15,7],[15,9,15,10],[15,11,15,12],[15,13,15,14],[15,17,15,18],[15,19,15,20],[15,23,15,24],[15,25,15,26],[16,0,16,2],[16,3,16,10],[16,11,16,12],[16,13,16,14],[16,15,16,26],[16,27,16,31],[17,0,17,7],[17,8,17,10],[17,11,17,12],[17,13,17,14],[17,15,18,16],[17,17,17,18],[17,19,17,20],[17,23,17,24],[17,25,17,26],[17,27,17,31],[18,0,18,7],[18,8,18,10],[18,11,18,12],[18,13,18,14],[18,17,18,18],[18,19,18,20],[18,23,18,24],[18,25,18,26],[18,27,18,31],[18,44,18,47],[19,0,19,2],[19,3,19,10],[19,11,19,12],[19,13,19,14],[19,15,19,26],[19,27,19,31],[19,44,19,47],[20,0,20,7],[20,8,20,10],[20,11,20,12],[20,13,20,14],[20,17,20,18],[20,19,20,20],[20,21,21,22],[20,23,20,24],[20,25,20,26],[20,27,20,31],[21,0,21,7],[21,8,21,10],[21,11,21,12],[21,13,21,14],[21,17,21,18],[21,19,21,20],[21,23,21,24],[21,25,21,26],[21,27,21,31],[21,44,21,45],[21,46,21,47],[22,0,22,2],[22,3,22,10],[22,11,22,12],[22,13,22,14],[22,15,22,26],[22,27,22,31],[22,44,22,45],[22,46,22,47],[23,0,23,7],[23,8,23,10],[23,11,23,12],[23,13,23,14],[23,17,23,18],[23,19,23,20],[23,21,24,22],[23,23,23,24],[23,25,23,26],[23,27,23,31],[24,0,24,7],[24,8,24,10],[24,11,24,12],[24,13,24,14],[24,17,24,18],[24,19,24,20],[24,23,24,24],[24,25,24,26],[24,27,24,31],[25,0,25,2],[25,3,25,10],[25,11,25,12],[25,13,25,14],[25,15,25,26],[25,27,25,31],[26,0,26,7],[26,8,26,10],[26,11,26,12],[26,13,26,14],[26,17,26,18],[26,19,26,20],[26,21,27,22],[26,23,26,24],[26,25,26,26],[26,27,26,31],[27,0,27,7],[27,8,27,10],[27,11,27,12],[27,13,27,14],[27,17,27,18],[27,19,27,20],[27,23,27,24],[27,25,27,26],[27,27,27,31],[28,0,28,2],[28,3,28,5],[28,6,28,31],[29,0,29,2],[29,3,29,5],[29,6,29,31],[30,0,30,2],[30,3,30,5],[30,6,30,31],[31,0,31,2],[31,3,31,5],[31,6,31,31],[32,0,32,2],[32,3,32,5],[32,6,32,31],[32,44,32,49],[33,0,33,2],[33,3,33,5],[33,6,33,31],[34,0,34,31],[35,0,37,31],[38,0,38,12],[38,13,38,25],[38,26,38,31],[39,0,39,8],[39,9,39,12],[39,13,40,17],[39,18,40,25],[39,26,40,31],[40,0,40,2],[40,3,40,5],[40,6,40,8],[40,9,40,12],[41,0,41,2],[41,3,41,5],[41,6,41,8],[41,9,41,12],[41,13,42,17],[41,18,42,25],[41,26,42,31],[42,0,42,8],[42,9,42,12],[42,38,42,41],[43,0,43,2],[43,3,43,5],[43,6,43,8],[43,9,43,12],[43,13,44,17],[43,18,44,25],[43,26,44,31],[44,0,44,2],[44,3,44,5],[44,6,44,8],[44,9,44,12],[50,44,50,49],[68,44,68,49],[79,46,79,48],[80,47,80,48],[80,51,80,54],[80,57,80,60],[81,46,81,47],[82,46,82,47],[83,47,83,48],[83,51,83,54],[84,46,84,47],[85,46,85,47],[86,47,86,48],[86,51,86,54],[87,46,87,47],[88,46,88,47],[89,47,89,48],[89,51,89,54],[90,46,90,47],[91,46,91,47]]}
["Name",{"$nulls":13},"Phone",{"$nulls":23},"Nutrient Removal Reference Table",{"$nulls":5},"Soil Test Units",null,null,"Plant Available Nitrogen Chart",{"$nulls":7},2020,null,"Fertilizers","Nutrient Density","Nutrient Concentration",null,null,"form"]
[{"$nulls":38},"Crop","Unit","N","P","K",null,"lb/ac",null,null,"Application & Incorporation Plan",{"$nulls":3},"Organic N","Ammonia N",null,null,2021,null,null,"N","N","P2O5","K2O"]
["Field Information",{"$nulls":37},"Alfalfa","Ton",null,13,50,null,"ppm",null,null,"Mar - Apr Application; < 3 Days to Incorp",{"$nulls":3},{"v":0.33,"d":"33%"},{"v":0.5,"d":"50%"},null,null,2022,null,"APP - (10-34-0)",11.7,{"v":0.1,"d":"10%"},{"v":0.34,"d":"34%"},{"v":0,"d":"0%"},"gal."]
["Field Name",{"$nulls":13},"Field Location",{"$nulls":23},"Barley","Bu",null,0.25,0.2,{"$nulls":4},"Mar - Apr Application; > 3 Days to Incorp",{"$nulls":3},{"v":0.33,"d":"33%"},{"v":0.25,"d":"25%"},null,null,2023,null,"Anhydrous Am - (82-0-0)",1,{"v":0.82,"d":"82%"},{"v":0,"d":"0%"},{"v":0,"d":"0%"},"lbs."]
["FSA Farm #",{"$nulls":6},"FSA Tract #",{"$nulls":6},"Field Size",{"$nulls":4},"Ac.",null,"County",{"$nulls":16},"Bluegrass pasture","Ton",null,7.33,50,{"$nulls":4},"Apr - June Application; < 1 Days to Incorp",{"$nulls":3},{"v":0.33,"d":"33%"},{"v":0.75,"d":"75%"},null,null,2024,null,"DAP - (18-46-0)",1,{"v":0.18,"d":"18%"},{"v":0.46,"d":"46%"},{"v":0,"d":"0%"},"lbs."]
["Soil Test Results",{"$nulls":37},"Bluegrass seeding","Ton",null,7.33,50,null,"Soil Test Phosphorus Test Method",null,null,"Apr - June Application; > 1 Days to Incorp",{"$nulls":3},{"v":0.33,"d":"33%"},{"v":0.25,"d":"25%"},null,null,2025,null,"KMag -  (0-0-22-23)",1,{"v":0,"d":"0%"},{"v":0,"d":"0%"},{"v":0.22,"d":"22%"},"lbs."]
["Soil Test Date",{"$nulls":8},"Soil Test Lab",{"$nulls":28},"Canola","Bu",null,0.7,0.46,{"$nulls":4},"Jul - Aug Application; < 1 Days to Incorp",{"$nulls":3},{"v":0.15,"d":"15%"},{"v":0.75,"d":"75%"},null,null,2026,null,"Liquid UAN - (28-0-0)",10.7,{"v":0.28,"d":"28%"},{"v":0,"d":"0%"},{"v":0,"d":"0%"},"gal."]
["Soil Test Method",{"$nulls":8},"Soil Test #",{"$nulls":5},"Soil Test #",{"$nulls":5},"Soil Test  #",{"$nulls":16},"Corn","Bu",null,0.37,0.27,null,"Bray P1",null,null,"Jul - Aug Application; > 1 Days to Incorp",{"$nulls":3},{"v":0.15,"d":"15%"},{"v":0.25,"d":"25%"},null,null,2027,null,"Liquid UAN - (32-0-0)",10.7,{"v":0.32,"d":"32%"},{"v":0,"d":"0%"},{"v":0,"d":"0%"},"gal."]
[{"$nulls":9},"CEC",null,"P",null,"K",null,"CEC",null,"P",null,"K",null,"CEC",null,"P",null,"K",{"$nulls":12},"Corn silage","Ton",null,3.3,8,null,"Mehlich III",null,null,"Sep - Oct Application; < 1 Days to Incorp",{"$nulls":3},{"v":0.33,"d":"33%"},{"v":0.25,"d":"25%"},null,null,2028,null,"MAP - (11-52-0)",1,{"v":0.11,"d":"11%"},{"v":0.52,"d":"52%"},{"v":0,"d":"0%"},"lbs."]
["Soil Test Units",{"$nulls":26},"Seasonal Timing of Variable Rate Application",{"$nulls":10},"Grass pasture","Ton",null,13,50,{"$nulls":4},"Sep - Oct Application; > 1 Days to Incorp",{"$nulls":3},{"v":0.33,"d":"33%"},{"v":0.15,"d":"15%"},null,null,2029,null,"Potash - (0-0-60)",1,{"v":0,"d":"0%"},{"v":0,"d":"0%"},{"v":0.6,"d":"60%"},"lbs."]
[{"$nulls":38},"Legume pasture","Ton",null,13,50,{"$nulls":12},2030,null,"Sulfate of Potash - (0-0-50)",1,{"v":0,"d":"0%"},{"v":0,"d":"0%"},{"v":0.5,"d":"50%"},"lbs."]
["Year",null,null,"Crop",null,null,"Avg Yield",null,null,"N",null,"Tri-State Fertilizer Recommendation (lbs/ac.)",{"$nulls":26},"Legume-grass pasture","Ton",null,13,50,{"$nulls":12},2031,null,"Urea - (46-0-0)",1,{"v":0.46,"d":"46%"},{"v":0,"d":"0%"},{"v":0,"d":"0%"},"lbs."]
[{"$nulls":8},{"$f":"IFERROR(VLOOKUP($D13,$AY$27:$AZ$42,2,FALSE),\"\")","v":""},{"$f":"IFERROR(MAX(INDEX($AS$36:$AX$36,MATCH($D13,AS$36:$AS$36,0),6),0),0)","v":0},null,{"$f":"IF($AU$35>0,IFERROR(INDEX($AY$27:$BU$42,MATCH(D13,$AY$27:$AY$42,0),MATCH($AU36,$AY$27:$BU$27,0)),0),0)","v":0},null,{"$f":"IF($AV$35>0,IFERROR(IF(INDEX($AY$27:$BU$42,MATCH(D13,$AY$27:$AY$42,0),MATCH($AV36,$AY$27:$BU$27,0))>300, 300,(INDEX($AY$27:$BU$42,MATCH(D13,$AY$27:$AY$42,0),MATCH($AV36,$AY$27:$BU$27,0)))),0),0)","v":0},{"$nulls":3},{"$f":"IF($AU$53>0,IFERROR(INDEX($AY$45:$BU$60,MATCH(D13,$AY$45:$AY$60,0),MATCH($AU54,$AY$45:$BU$45,0)),0),0)","v":0},null,{"$f":"IF($AV$53>0,IFERROR(IF(INDEX($AY$45:$BU$60,MATCH(D13,$AY$45:$AY$60,0),MATCH($AV54,$AY$45:$BU$45,0))>300, 300,(INDEX($AY$45:$BU$60,MATCH(D13,$AY$45:$AY$60,0),MATCH($AV54,$AY$45:$BU$45,0)))),0),0)","v":0},{"$nulls":3},{"$f":"IF($AU$71>0,IFERROR(INDEX($AY$63:$BU$78,MATCH(D13,$AY$63:$AY$78,0),MATCH($AU72,$AY$63:$BU$63,0)),0),0)","v":0},null,{"$f":"IF($AV$71>0,IFERROR(IF(INDEX($AY$63:$BU$78,MATCH(D13,$AY$63:$AY$78,0),MATCH($AV72,$AY$63:$BU$63,0))>300, 300,(INDEX($AY$63:$BU$78,MATCH(D13,$AY$63:$AY$78,0),MATCH($AV72,$AY$63:$BU$63,0)))),0),0)","v":0},{"$nulls":12},"Legume-tall grass","Ton",null,13,50,{"$nulls":14},"AMS - 21-0-0-24S",1,{"v":0.21,"d":"21%"},{"v":0,"d":"0%"},{"v":0,"d":"0%"},"lbs."]
[{"$f":"IF(A13>0,$A13+1,\"\")","v":""},{"$nulls":7},{"$f":"IFERROR(VLOOKUP($D14,$AY$27:$AZ$42,2,FALSE),\"\")","v":""},{"$f":"IFERROR(MAX(INDEX($AS$37:$AX$37,MATCH($D14,AS$37:$AS$37,0),6),0),0)","v":0},null,{"$f":"IF($AU$35>0,IFERROR(INDEX($AY$27:$BU$42,MATCH(D14,$AY$27:$AY$42,0),MATCH($AU37,$AY$27:$BU$27,0)),0),0)","v":0},null,{"$f":"IF($AV$35>0,IFERROR(IF(INDEX($AY$27:$BU$42,MATCH(D14,$AY$27:$AY$42,0),MATCH($AV37,$AY$27:$BU$27,0))>300, 300,(INDEX($AY$27:$BU$42,MATCH(D14,$AY$27:$AY$42,0),MATCH($AV37,$AY$27:$BU$27,0)))),0),0)","v":0},{"$nulls":3},{"$f":"IF($AU$53>0,IFERROR(INDEX($AY$45:$BU$60,MATCH(D14,$AY$45:$AY$60,0),MATCH($AU55,$AY$45:$BU$45,0)),0),0)","v":0},null,{"$f":"IF($AV$53>0,IFERROR(IF(INDEX($AY$45:$BU$60,MATCH(D14,$AY$45:$AY$60,0),MATCH($AV55,$AY$45:$BU$45,0))>300, 300,(INDEX($AY$45:$BU$60,MATCH(D14,$AY$45:$AY$60,0),MATCH($AV55,$AY$45:$BU$45,0)))),0),0)","v":0},{"$nulls":3},{"$f":"IF($AU$71>0,IFERROR(INDEX($AY$63:$BU$78,MATCH(D14,$AY$63:$AY$78,0),MATCH($AU73,$AY$63:$BU$63,0)),0),0)","v":0},null,{"$f":"IF($AV$71>0,IFERROR(IF(INDEX($AY$63:$BU$78,MATCH(D14,$AY$63:$AY$78,0),MATCH($AV73,$AY$63:$BU$63,0))>300, 300,(INDEX($AY$63:$BU$78,MATCH(D14,$AY$63:$AY$78,0),MATCH($AV73,$AY$63:$BU$63,0)))),0),0)","v":0},{"$nulls":12},"Legume-tall grass seeding","Ton",null,13,50,null,"Manure Type",{"$nulls":12},"Liquid AMS - 8-0-0-9S",10.13,{"v":0.08,"d":"8%"},{"v":0,"d":"0%"},{"v":0,"d":"0%"},"gal."]
[{"$f":"IFERROR($A14+1, \"\")","v":""},{"$nulls":7},{"$f":"IFERROR(VLOOKUP($D15,$AY$27:$AZ$42,2,FALSE),\"\")","v":""},{"$f":"IFERROR(MAX(INDEX($AS$38:$AX$38,MATCH($D15,AS$38:$AS$38,0),6),0),0)","v":0},null,0,null,0,{"$nulls":3},0,null,0,{"$nulls":3},0,null,0,null,"Application Method",{"$nulls":10},"Oats","Bu",null,0.25,0.19,null,"Solid","lb/ton","ton","ton/ac",{"$nulls":9},"MESZ® - 12-40-0",1,{"v":0.12,"d":"12%"},{"v":0.4,"d":"40%"},{"v":0,"d":"0%"},"lbs."]
[{"$f":"IFERROR($A15+1, \"\")","v":""},{"$nulls":7},{"$f":"IFERROR(VLOOKUP($D16,$AY$27:$AZ$42,2,FALSE),\"\")","v":""},{"$f":"IFERROR(MAX(INDEX($AS$39:$AX$39,MATCH($D16,AS$39:$AS$39,0),6),0),0)","v":0},null,0,null,0,{"$nulls":3},0,null,0,{"$nulls":3},0,null,0,{"$nulls":12},"Rye","Bu",null,0.64,0.36,null,"Liquid","lb/1000 Gal","gal","gal/ac",{"$nulls":9},{"$f":"IF(ISBLANK(A40),\" \",A40)","v":" "},{"$f":"IF(BK16=\"gal.\", 11, 1)","v":1},{"$f":"IF($BK16=\"tons\",A42,(A42*0.01))","v":{"v":0,"d":"0%"}},{"$f":"IF($BK16=\"tons\",D42,(D42*0.01))","v":{"v":0,"d":"0%"}},{"$f":"IF($BK16=\"tons\",G42,(G42*0.01))","v":{"v":0,"d":"0%"}},{"$f":"IF(J42=\"lbs.\",\"lbs.\",IF(J42=\"gal.\",\"gal.\",IF(J42=\"lbs/ton\",\"tons\",\"\")))","v":""}]
[{"$f":"IF(A13>0,$A13,\"\")","v":""},null,null,"Nutrient Credits",{"$nulls":11},"Applied P205 or K20 ",{"$nulls":22},"Small grain forage","Ton",null,13,50,{"$nulls":14},{"$f":"IF(ISBLANK(A43),\" \",A43)","v":" "},{"$f":"IF(BK17=\"gal.\", 11, 1)","v":1},{"$f":"IF(BK17=\"tons\",A45,(A45*0.01))","v":{"v":0,"d":"0%"}},{"$f":"IF(BK17=\"tons\",D45,(D45*0.01))","v":{"v":0,"d":"0%"}},{"$f":"IF(BK17=\"tons\",G45,(G45*0.01))","v":{"v":0,"d":"0%"}},{"$f":"IF(J45=\"lbs.\",\"lbs.\",IF(J45=\"gal.\",\"gal.\",IF(J45=\"lbs/ton\",\"tons\",\"\")))","v":""}]
[{"$nulls":8},{"$f":"IFERROR(INDEX($BF$2:$BK$17,MATCH($A18,FertList,0),6),\"\")","v":""},null,null,{"$f":"IFERROR(BD82,\"\")","v":""},null,{"$f":"IFERROR(BE82,\"\")","v":""},{"$nulls":3},{"$f":"IFERROR(BF82,\"\")","v":""},null,{"$f":"IFERROR(BG82,\"\")","v":""},{"$nulls":3},{"$f":"IFERROR(BH82,\"\")","v":""},null,{"$f":"IFERROR(BI82,\"\")","v":""},{"$nulls":12},"Sorghum","Bu",null,0.22,0.22]
[{"$nulls":8},{"$f":"IFERROR(INDEX($BF$2:$BK$17,MATCH($A19,FertList,0),6),\"\")","v":""},null,null,{"$f":"IFERROR(BD83,\"\")","v":""},null,{"$f":"IFERROR(BE83,\"\")","v":""},{"$nulls":3},{"$f":"IFERROR(BF83,\"\")","v":""},null,{"$f":"IFERROR(BG83,\"\")","v":""},{"$nulls":3},{"$f":"IFERROR(BH83,\"\")","v":""},null,{"$f":"IFERROR(BI83,\"\")","v":""},{"$nulls":12},"Sorghum-sudan forage","Ton",null,4.6,18,null,"Manure App Rate Multiplier"]
[{"$f":"A14","v":""},null,null,"Nutrient Credits",{"$nulls":11},"Applied P205 or K20 ",{"$nulls":22},"Soybean","Bu",null,0.8,1.4,null,{"$f":"IF(P37=\"Liquid\",1000,1)","v":1}]
[{"$nulls":8},{"$f":"IFERROR(INDEX($BF$2:$BK$17,MATCH($A21,FertList,0),6),\"\")","v":""},null,null,{"$f":"IFERROR(BD85,\"\")","v":""},null,{"$f":"IFERROR(BE85,\"\")","v":""},{"$nulls":3},{"$f":"IFERROR(BF85,\"\")","v":""},null,{"$f":"IFERROR(BG85,\"\")","v":""},{"$nulls":3},{"$f":"IFERROR(BH85,\"\")","v":""},null,{"$f":"IFERROR(BI85,\"\")","v":""},{"$nulls":12},"Spelt","Bu",null,0.63,0.37,null,"RoundDown Rate decimal Factor"]
[{"$nulls":8},{"$f":"IFERROR(INDEX($BF$2:$BK$17,MATCH($A22,FertList,0),6),\"\")","v":""},null,null,{"$f":"IFERROR(BD86,\"\")","v":""},null,{"$f":"IFERROR(BE86,\"\")","v":""},{"$nulls":3},{"$f":"IFERROR(BF86,\"\")","v":""},null,{"$f":"IFERROR(BG86,\"\")","v":""},{"$nulls":3},{"$f":"IFERROR(BH86,\"\")","v":""},null,{"$f":"IFERROR(BI86,\"\")","v":""},{"$nulls":12},"Sugar beet","Ton",null,1.3,3.3,null,"Rate",null,"Field Total"]
[{"$f":"A15","v":""},null,null,"Nutrient Credits",{"$nulls":11},"Applied P205 or K20 ",{"$nulls":22},"Tomato ","Ton",null,2.18,7,null,{"$f":"IF(P37=\"Liquid\",-2,1)","v":1},null,{"$f":"IF(P37=\"Liquid\",-2,0)","v":0}]
[{"$nulls":8},{"$f":"IFERROR(INDEX($BF$2:$BK$17,MATCH($A24,FertList,0),6),\"\")","v":""},null,null,{"$f":"IFERROR(BD88,\"\")","v":""},null,{"$f":"IFERROR(BE88,\"\")","v":""},{"$nulls":3},{"$f":"IFERROR(BF88,\"\")","v":""},null,{"$f":"IFERROR(BG88,\"\")","v":""},{"$nulls":3},{"$f":"IFERROR(BH88,\"\")","v":""},null,{"$f":"IFERROR(BI88,\"\")","v":""},{"$nulls":12},"Wheat","Bu",null,0.63,0.37]
[{"$nulls":8},{"$f":"IFERROR(INDEX($BF$2:$BK$17,MATCH($A25,FertList,0),6),\"\")","v":""},null,null,{"$f":"IFERROR(BD89,\"\")","v":""},null,{"$f":"IFERROR(BE89,\"\")","v":""},{"$nulls":3},{"$f":"IFERROR(BF89,\"\")","v":""},null,{"$f":"IFERROR(BG89,\"\")","v":""},{"$nulls":3},{"$f":"IFERROR(BH89,\"\")","v":""},null,{"$f":"IFERROR(BI89,\"\")","v":""},{"$nulls":12},"Wheat w/Stover","Bu",null,0.72,1.28]
[{"$f":"A16","v":""},null,null,"Nutrient Credits",{"$nulls":11},"Applied P205 or K20 ",{"$nulls":34},1,2,3,4,5,6,7,8,9,10,11,12,13,14,15,16,17,18,19,20,21,22,23,24]
[{"$nulls":8},{"$f":"IFERROR(INDEX($BF$2:$BK$17,MATCH($A27,FertList,0),6),\"\")","v":""},null,null,{"$f":"IFERROR(BD91,\"\")","v":""},null,{"$f":"IFERROR(BE91,\"\")","v":""},{"$nulls":3},{"$f":"IFERROR(BF91,\"\")","v":""},null,{"$f":"IFERROR(BG91,\"\")","v":""},{"$nulls":3},{"$f":"IFERROR(BH91,\"\")","v":""},null,{"$f":"IFERROR(BI91,\"\")","v":""},{"$nulls":12},"App Method","Timing","Unit",{"$nulls":10},"Unit","YP","P","K","P Buildup","P Maintenance","P Drawdown","No Apply","K Buildup","K Maintenance","K Drawdown","P Critical Level","P Maintenance Top Level","P Maintenance Top Level","P Upper Level","K CL","K ML","K DL","K Divisor","N Credit","NRemoval","NRx","Max N"]
[{"$nulls":8},{"$f":"IFERROR(INDEX($BF$2:$BK$17,MATCH($A28,FertList,0),6),\"\")","v":""},null,null,{"$f":"IFERROR(BD92,\"\")","v":""},null,{"$f":"IFERROR(BE92,\"\")","v":""},{"$nulls":3},{"$f":"IFERROR(BF92,\"\")","v":""},null,{"$f":"IFERROR(BG92,\"\")","v":""},{"$nulls":3},{"$f":"IFERROR(BH92,\"\")","v":""},null,{"$f":"IFERROR(BI92,\"\")","v":""},{"$nulls":12},"Select","Select","Select",{"$nulls":9},"Alfalfa","Ton",{"$f":"INDEX($AS$36:$AT$39,MATCH($AY28,$AS$36:$AS$39,0),2)","v":{"$error":"#N/A"}},13,50,{"$f":"((($BK28-$AU$35)*5)+(BE28))","v":{"$error":"#VALUE!"}},{"$f":"BA28*BB28","v":{"$error":"#N/A"}},{"$f":"($BE28-($BE28*($AU$35-($BK28+15))/10))","v":{"$error":"#N/A"}},0,{"$f":"(($BO28-$AV$35)*((1+(0.05*$AW$35)))+(BA28*BC28)+20)","v":{"$error":"#N/A"}},{"$f":"((BA28*BC28)+20)-(((BA28*BC28)+20)*($AV$35-BO28)/BR28)","v":{"$error":"#N/A"}},{"$f":"((BA28*BC28)+20)-(((BA28*BC28)+20)*($AV$35-BO28)/BR28)","v":{"$error":"#N/A"}},25,{"$f":"BK28+0.1","v":25.1},{"$f":"BK28+15.1","v":40.1},{"$f":"BK28+24.9","v":49.9},{"$f":"75+(2.5*$AW$35)","v":75},{"$f":"BO28+30","v":105},{"$f":"BO28+50","v":125},50,140,40,null,{"$f":"MIN((BT28*BA28),150)","v":{"$error":"#N/A"}}]
["Yes",null,null,"No",null,null,"Checklist",{"$nulls":43},"Barley","Bu",{"$error":"#N/A"},0.25,0.2,{"$error":"#VALUE!"},{"$f":"BA29*BB29","v":{"$error":"#N/A"}},{"$f":"($BE29-($BE29*($AU$35-($BK29+15))/10))","v":{"$error":"#N/A"}},0,{"$error":"#N/A"},{"$f":"(BA29*BC29)+20","v":{"$error":"#N/A"}},{"$f":"((BA29*BC29)+20)-(((BA29*BC29)+20)*($AV$35-(BO29+30))/BR29)","v":{"$error":"#N/A"}},25,{"$f":"BK29+0.1","v":25.1},{"$f":"BK29+15.1","v":40.1},{"$f":"BK29+24.9","v":49.9},{"$f":"75+(2.5*$AW$35)","v":75},{"$f":"BO29+30","v":105},{"$f":"BO29+50","v":125},20,0,1,{"$f":"-27+(BT29*BA29)","v":{"$error":"#N/A"}},{"$f":"BU29","v":{"$error":"#N/A"}}]
[{"$nulls":6},"Soil tests are four years old or less",{"$nulls":31},"Foliar","Fall","gal.",{"$nulls":9},"Corn","Bu",{"$error":"#N/A"},0.37,0.27,{"$error":"#VALUE!"},{"$f":"BA30*BB30","v":{"$error":"#N/A"}},{"$error":"#N/A"},0,{"$error":"#N/A"},{"$f":"(BA30*BC30)+20","v":{"$error":"#N/A"}},{"$f":"((BA30*BC30)+20)-(((BA30*BC30)+20)*($AV$35-(BO30+30))/BR30)","v":{"$error":"#N/A"}},15,15.1,30.1,39.9,75,105,125,20,0,1.36,{"$error":"#N/A"},{"$error":"#N/A"}]
[{"$nulls":6},"VRT application recommendations have been verified for Tri-State?",{"$nulls":31},"Inject","Spring","lbs.",{"$nulls":9},"Corn silage","Ton",{"$error":"#N/A"},3.3,8,{"$error":"#VALUE!"},{"$error":"#N/A"},{"$error":"#N/A"},0,{"$error":"#N/A"},{"$f":"((BA31*BC31)+20)-(((BA31*BC31)+20)*($AV$35-BO31)/BR31)","v":{"$error":"#N/A"}},{"$f":"((BA31*BC31)+20)-(((BA31*BC31)+20)*($AV$35-BO31)/BR31)","v":{"$error":"#N/A"}},15,15.1,30.1,39.9,75,105,125,50,0,9.4,{"$error":"#N/A"},{"$error":"#N/A"}]
[{"$nulls":6},"Identification of all nutrients planned for application are documented?",{"$nulls":31},"Manure Spreader","Summer","lbs/ton",{"$nulls":9},"Grass pasture","Ton",{"$error":"#N/A"},13,50,{"$error":"#VALUE!"},{"$error":"#N/A"},{"$error":"#N/A"},0,{"$error":"#N/A"},{"$f":"((BA32*BC32)+20)-(((BA32*BC32)+20)*($AV$35-BO32)/BR32)","v":{"$error":"#N/A"}},{"$f":"((BA32*BC32)+20)-(((BA32*BC32)+20)*($AV$35-BO32)/BR32)","v":{"$error":"#N/A"}},25,25.1,40.1,49.9,75,105,125,50,40,40,{"$error":"#N/A"},{"$error":"#N/A"}]
[{"$nulls":6},"Starter/Pop-up fertilizer is accounted for?",{"$nulls":31},"Pop-Up",{"$nulls":5},"Recommendations",{"$nulls":5},"Legume pasture","Ton",{"$error":"#N/A"},13,50,{"$error":"#VALUE!"},{"$error":"#N/A"},{"$error":"#N/A"},0,{"$error":"#N/A"},{"$f":"((BA33*BC33)+20)-(((BA33*BC33)+20)*($AV$35-BO33)/BR33)","v":{"$error":"#N/A"}},{"$f":"((BA33*BC33)+20)-(((BA33*BC33)+20)*($AV$35-BO33)/BR33)","v":{"$error":"#N/A"}},25,25.1,40.1,49.9,75,105,125,50,100,40,{"$error":"#N/A"},{"$error":"#N/A"}]
[{"$nulls":6},"Method and seasonal timing of application is documented?",{"$nulls":31},"Subsurface Band",{"$nulls":7},"P","K","CEC","N Rec","Oats","Bu",{"$error":"#N/A"},0.25,0.19,{"$error":"#VALUE!"},{"$error":"#N/A"},{"$error":"#N/A"},0,{"$error":"#N/A"},{"$f":"(BA34*BC34)+20","v":{"$error":"#N/A"}},{"$f":"((BA34*BC34)+20)-(((BA34*BC34)+20)*($AV$35-(BO34+30))/BR34)","v":{"$error":"#N/A"}},25,25.1,40.1,49.9,75,105,125,20,0,0.7,{"$error":"#N/A"},{"$error":"#N/A"}]
["If any of the above answers are No please document how you will meet the requirements of an VNMP",{"$nulls":37},"Sidedress (Inject)",{"$nulls":7},{"$f":"IFERROR(IF(AND($E$8=\"Bray P1\",$E$10=\"ppm\"),$L$10,IF(AND($E$8=\"Bray P1\",$E$10=\"lb/ac\"),($L$10/2),IF(AND($E$8=\"Mehlich III\",$E$10=\"ppm\"),INDEX(VRTConversion,MATCH((ROUND($L$10,0)),$AO$45:AO284,0),1),INDEX(VRTConversion,MATCH(ROUND($L$10/2,0),$AO$45:AO284,0),1)))),IF(L10>0,1,\"\"))","v":""},{"$f":"IF($E$10=\"ppm\",$N$10,$N$10/2)","v":0},{"$f":"J10","v":{"v":0,"d":"0.0"}},null,"Rye","Bu",{"$error":"#N/A"},0.64,0.36,{"$error":"#VALUE!"},{"$error":"#N/A"},{"$error":"#N/A"},0,{"$error":"#N/A"},{"$f":"(BA35*BC35)+20","v":{"$error":"#N/A"}},{"$f":"((BA35*BC35)+20)-(((BA35*BC35)+20)*($AV$35-(BO35+30))/BR35)","v":{"$error":"#N/A"}},25,25.1,40.1,49.9,75,105,125,20,0,1.3,{"$f":"40+(1.75*(BA35-50))","v":{"$error":"#N/A"}},{"$error":"#N/A"}]
[{"$nulls":38},"Broadcast W/ Incorp",{"$nulls":5},{"$f":"$D$13","v":0},{"$f":"$G$13","v":0},{"$f":"IF($AU$35<=VLOOKUP($AS36,Reference1,13),\"P Buildup\",IF(AND($AU$35>=VLOOKUP($AS36,Reference1,14),$AU$35<=VLOOKUP($AS36,Reference1,15)),\"P Maintenance\",IF(AND($AU$35>VLOOKUP($AS36,Reference1,15),($AU$35<VLOOKUP($AS36,Reference1,16))),\"P Drawdown\", \"No Apply\")))","v":{"$error":"#N/A"}},{"$f":"IF($AV$35>=VLOOKUP($AS36,$AY$27:$BV$42,19),\"No Apply\",IF($AV$35<=VLOOKUP($AS36,$AY$27:$BV$42,17), \"K Buildup\", IF(AND($AV$35>=VLOOKUP($AS36,$AY$27:$BV$42,17),($AV$35<=(VLOOKUP($AS36,$AY$27:$BV$42,18)-0.1))), \"K Maintenance\", \"K Drawdown\")))","v":{"$error":"#N/A"}},{"$f":"IFERROR(IF(OR($AS35=\"Wheat\",$AS35=\"Wheat w/ Stover\",$AS35=\"Rye\",$AS35=\"Spelt\"),0,INDEX($AY$28:$BU$42,MATCH($AS35,Crop,0),21)),0)","v":0},{"$f":"(INDEX($AY$28:$BU$42,MATCH(AS36,Crop,0),23))-AW36","v":{"$error":"#N/A"}},"Sorghum","Bu",{"$error":"#N/A"},0.22,0.22,{"$error":"#VALUE!"},{"$error":"#N/A"},{"$error":"#N/A"},0,{"$error":"#N/A"},{"$f":"(BA36*BC36)+20","v":{"$error":"#N/A"}},{"$f":"((BA36*BC36)+20)-(((BA36*BC36)+20)*($AV$35-(BO36+30))/BR36)","v":{"$error":"#N/A"}},15,15.1,30.1,39.9,75,105,125,20,0,0.7,{"$f":"-27+(BT36*BA36)","v":{"$error":"#N/A"}},{"$error":"#N/A"}]
[{"$nulls":38},"Broadcast W/O Incorp",{"$nulls":5},{"$f":"$D$14","v":0},{"$f":"$G$14","v":0},{"$f":"IF($AU$35<=VLOOKUP($AS37,Reference1,13),\"P Buildup\",IF(AND($AU$35>=VLOOKUP($AS37,Reference1,14),$AU$35<=VLOOKUP($AS37,Reference1,15)),\"P Maintenance\",IF(AND($AU$35>VLOOKUP($AS37,Reference1,15),($AU$35<VLOOKUP($AS37,Reference1,16))),\"P Drawdown\", \"No Apply\")))","v":{"$error":"#N/A"}},{"$f":"IF($AV$35>=VLOOKUP($AS37,$AY$27:$BV$42,19),\"No Apply\",IF($AV$35<=VLOOKUP($AS37,$AY$27:$BV$42,17), \"K Buildup\", IF(AND($AV$35>=VLOOKUP($AS37,$AY$27:$BV$42,17),($AV$35<=(VLOOKUP($AS37,$AY$27:$BV$42,18)-0.1))), \"K Maintenance\", \"K Drawdown\")))","v":{"$error":"#N/A"}},{"$f":"IFERROR(IF(OR($AS36=\"Wheat\",$AS36=\"Wheat w/ Stover\",$AS36=\"Rye\",$AS36=\"Spelt\"),0,INDEX($AY$28:$BU$42,MATCH($AS36,Crop,0),21)),0)","v":0},{"$f":"(INDEX($AY$28:$BU$42,MATCH(AS37,Crop,0),23))-AW37","v":{"$error":"#N/A"}},"Sorghum-sudan forage","Ton",{"$error":"#N/A"},4.6,18,{"$error":"#VALUE!"},{"$error":"#N/A"},{"$error":"#N/A"},0,{"$error":"#N/A"},{"$f":"((BA37*BC37)+20)-(((BA37*BC37)+20)*($AV$35-BO37)/BR37)","v":{"$error":"#N/A"}},{"$f":"((BA37*BC37)+20)-(((BA37*BC37)+20)*($AV$35-BO37)/BR37)","v":{"$error":"#N/A"}},25,25.1,40.1,49.9,75,105,125,50,0,40,{"$f":"-27+(BT37*BA37)","v":{"$error":"#N/A"}},{"$error":"#N/A"}]
[{"$nulls":38},"Banding W/ Incorp",{"$nulls":5},{"$f":"$D$15","v":0},{"$f":"$G$15","v":0},{"$f":"IF($AU$35<=VLOOKUP($AS38,Reference1,13),\"P Buildup\",IF(AND($AU$35>=VLOOKUP($AS38,Reference1,14),$AU$35<=VLOOKUP($AS38,Reference1,15)),\"P Maintenance\",IF(AND($AU$35>VLOOKUP($AS38,Reference1,15),($AU$35<VLOOKUP($AS38,Reference1,16))),\"P Drawdown\", \"No Apply\")))","v":{"$error":"#N/A"}},{"$error":"#N/A"},{"$f":"IFERROR(IF(OR($AS37=\"Wheat\",$AS37=\"Wheat w/ Stover\",$AS37=\"Rye\",$AS37=\"Spelt\"),0,INDEX($AY$28:$BU$42,MATCH($AS37,Crop,0),21)),0)","v":0},{"$f":"(INDEX($AY$28:$BU$42,MATCH(AS38,Crop,0),23))-AW38","v":{"$error":"#N/A"}},"Soybean","Bu",{"$f":"INDEX($AS$36:$AT$39,MATCH($AY38,$AS$36:$AS$39,0),2)","v":{"$error":"#N/A"}},0.8,1.4,{"$error":"#VALUE!"},{"$error":"#N/A"},{"$f":"($BE38-($BE38*($AU$35-($BK38+15))/10))","v":{"$error":"#N/A"}},0,{"$f":"((($BO38-$AV$35)*((1+(0.05*$AW$35)))+((BA38*BC38))+20))","v":{"$error":"#N/A"}},{"$f":"((BA38*BC38)+20)","v":{"$error":"#N/A"}},{"$f":"((BA38*BC38)+20)-(((BA38*BC38)+20)*($AV$35-(BO38+30))/BR38)","v":{"$error":"#N/A"}},15,15.1,30.1,39.9,75,105,125,20,30,3.8,null,{"$f":"MIN((BT38*BA38),150)","v":{"$error":"#N/A"}}]
["Custom Fertilizer",{"$nulls":12},"Reviewed By",{"$nulls":12},"Date",{"$nulls":11},"Banding W/O Incorp",{"$nulls":5},{"$f":"$D$16","v":0},{"$f":"$G$16","v":0},{"$f":"IF($AU$35<=VLOOKUP($AS39,Reference1,13),\"P Buildup\",IF(AND($AU$35>=VLOOKUP($AS39,Reference1,14),$AU$35<=VLOOKUP($AS39,Reference1,15)),\"P Maintenance\",IF(AND($AU$35>VLOOKUP($AS39,Reference1,15),($AU$35<VLOOKUP($AS39,Reference1,16))),\"P Drawdown\", \"No Apply\")))","v":{"$error":"#N/A"}},{"$error":"#N/A"},{"$f":"IFERROR(IF(OR($AS38=\"Wheat\",$AS38=\"Wheat w/ Stover\",$AS38=\"Rye\",$AS38=\"Spelt\"),0,INDEX($AY$28:$BU$42,MATCH($AS38,Crop,0),21)),0)","v":0},{"$f":"(INDEX($AY$28:$BU$42,MATCH(AS39,Crop,0),23))-AW39","v":{"$error":"#N/A"}},"Spelt","Bu",{"$error":"#N/A"},0.63,0.37,{"$error":"#VALUE!"},{"$error":"#N/A"},{"$error":"#N/A"},0,{"$f":"(($BO39-$AV$35)*((1+(0.05*$AW$35)))+(BA39*BC39)+20)","v":{"$error":"#N/A"}},{"$f":"((BA39*BC39)+20)","v":{"$error":"#N/A"}},{"$f":"((BA39*BC39)+20)-(((BA39*BC39)+20)*($AV$35-(BO39+30))/BR39)","v":{"$error":"#N/A"}},25,25.1,40.1,49.9,75,105,125,20,0,1.3,{"$f":"-27+(BT39*BA39)","v":{"$error":"#N/A"}},{"$f":"BU39","v":{"$error":"#N/A"}}]
[{"$nulls":9},"Name",{"$nulls":3},"Plan Writer",{"$nulls":24},"On Growing Cover Crop",{"$nulls":9},"N Credit",null,"Tomato ","Ton",{"$error":"#N/A"},2.18,7,{"$f":"((($BK40-$AU$35)*5)+(BE40))","v":{"$error":"#VALUE!"}},{"$f":"$BA$40*BB40","v":{"$error":"#N/A"}},{"$f":"$BA$40*$BB$40","v":{"$error":"#N/A"}},0,{"$f":"(($BO40-$AV$35)*((1+(0.05*$AW$35)))+(BA40*BC40)+20)","v":{"$error":"#N/A"}},{"$f":"((BA40*BC40)+20)","v":{"$error":"#N/A"}},{"$f":"((BA40*BC40)+20)-(((BA40*BC40)+20)*($AV$35-(BO40+30))/BR40)","v":{"$error":"#N/A"}},45,45.1,80,80.1,{"$f":"75+(2.5*$AP$35)","v":75},105,125,20,0,null,80]
["N",null,null,"P",null,null,"K",null,null,"Units",{"$nulls":28},"Starter",{"$nulls":11},"Wheat","Bu",{"$error":"#N/A"},0.63,0.37,{"$error":"#VALUE!"},{"$f":"BA41*BB41","v":{"$error":"#N/A"}},{"$error":"#N/A"},0,{"$f":"(($BO41-$AV$35)*((1+(0.05*$AW$35)))+(BA41*BC41)+20)","v":{"$error":"#N/A"}},{"$f":"(BA41*BC41)+20","v":{"$error":"#N/A"}},{"$f":"((BA41*BC41)+20)-(((BA41*BC41)+20)*($AV$35-(BO41+30))/BR41)","v":{"$error":"#N/A"}},25,25.1,{"$f":"BK41+15.1","v":40.1},49.9,75,105,125,20,0,1.3,{"$f":"40+(1.75*(BA41-50))","v":{"$error":"#N/A"}},{"$f":"BU41","v":{"$error":"#N/A"}}]
[{"$nulls":13},"Checked By",{"$nulls":36},"Wheat w/Stover","Bu",{"$error":"#N/A"},0.72,1.28,{"$error":"#VALUE!"},{"$f":"BA42*BB42","v":{"$error":"#N/A"}},{"$error":"#N/A"},0,{"$f":"(($BO42-$AV$35)*((1+(0.05*$AW$35)))+(BA42*BC42)+20)","v":{"$error":"#N/A"}},{"$f":"(BA42*BC42)+20","v":{"$error":"#N/A"}},{"$f":"((BA42*BC42)+20)-(((BA42*BC42)+20)*($AV$35-(BO42+30))/BR42)","v":{"$error":"#N/A"}},25,25.1,{"$f":"BK42+15.1","v":40.1},49.9,75,105,125,20,0,1.3,{"$f":"40+(1.75*(BA42-50))","v":{"$error":"#N/A"}},{"$f":"BU42","v":{"$error":"#N/A"}}]
[{"$nulls":9},"Name",{"$nulls":28},"Soil Test Conversion"]
["N",null,null,"P",null,null,"K",null,null,"Units",{"$nulls":3},"Approved By",{"$nulls":24},"P1PPM","P1LB","M3PPM","M3LB",{"$nulls":8},1,2,3,4,5,6,7,8,9,10,11,12,13,14,15,16,17,18,19,20,21,22,23,24]
[{"$nulls":38},1,{"$f":"AM45*2","v":2},11,{"$f":"AO45*2","v":22},{"$nulls":9},"Unit","YP","P","K","P Buildup","P Maintenance","P Drawdown","No Apply","K Buildup","K Maintenance","K Drawdown","P Critical Level","P Maintenance Top Level","P Maintenance Top Level","P Upper Level","K CL","K ML","K DL","K Divisor","N Credit","NRemoval","NRx","Max N"]
[{"$nulls":38},2,{"$f":"AM46*2","v":4},12,{"$f":"AO46*2","v":24},{"$nulls":8},"Alfalfa","Ton",{"$f":"INDEX($AS$54:$AT$57,MATCH($AY46,$AS$36:$AS$39,0),2)","v":{"$error":"#N/A"}},13,50,{"$f":"((($BK46-$AU$53)*5)+(BE46))","v":{"$error":"#VALUE!"}},{"$f":"BA46*BB46","v":{"$error":"#N/A"}},{"$f":"($BE46-($BE46*($AU$53-($BK46+15))/10))","v":{"$error":"#N/A"}},0,{"$f":"(($BO46-$AV$53)*((1+(0.05*$AW$53)))+(BA46*BC46)+20)","v":{"$error":"#N/A"}},{"$f":"((BA46*BC46)+20)-(((BA46*BC46)+20)*($AV$53-BO46)/BR46)","v":{"$error":"#N/A"}},{"$f":"((BA46*BC46)+20)-(((BA46*BC46)+20)*($AV$53-BO46)/BR46)","v":{"$error":"#N/A"}},25,{"$f":"BK46+0.1","v":25.1},{"$f":"BK46+15.1","v":40.1},{"$f":"BK46+24.9","v":49.9},{"$f":"75+(2.5*$AW$53)","v":75},{"$f":"BO46+30","v":105},{"$f":"BO46+50","v":125},50,140,40,null,{"$f":"MIN((BT46*BA46),150)","v":{"$error":"#N/A"}}]
[{"$nulls":38},3,6,13,26,{"$nulls":8},"Barley","Bu",{"$f":"INDEX($AS$54:$AT$57,MATCH($AY47,$AS$36:$AS$39,0),2)","v":{"$error":"#N/A"}},0.25,0.2,{"$f":"((($BK47-$AU$53)*5)+(BE47))","v":{"$error":"#VALUE!"}},{"$f":"BA47*BB47","v":{"$error":"#N/A"}},{"$f":"($BE47-($BE47*($AU$53-($BK47+15))/10))","v":{"$error":"#N/A"}},0,{"$f":"(($BO47-$AV$53)*((1+(0.05*$AW$53)))+(BA47*BC47)+20)","v":{"$error":"#N/A"}},{"$f":"(BA47*BC47)+20","v":{"$error":"#N/A"}},{"$f":"((BA47*BC47)+20)-(((BA47*BC47)+20)*($AV$53-(BO47+30))/BR47)","v":{"$error":"#N/A"}},25,{"$f":"BK47+0.1","v":25.1},{"$f":"BK47+15.1","v":40.1},{"$f":"BK47+24.9","v":49.9},{"$f":"75+(2.5*$AW$53)","v":75},{"$f":"BO47+30","v":105},{"$f":"BO47+50","v":125},20,0,1,{"$f":"-27+(BT47*BA47)","v":{"$error":"#N/A"}},{"$f":"BU47","v":{"$error":"#N/A"}}]
[{"$nulls":38},4,8,14,28,{"$nulls":8},"Corn","Bu",{"$error":"#N/A"},0.37,0.27,{"$error":"#VALUE!"},{"$f":"BA48*BB48","v":{"$error":"#N/A"}},{"$error":"#N/A"},0,{"$error":"#N/A"},{"$f":"(BA48*BC48)+20","v":{"$error":"#N/A"}},{"$f":"((BA48*BC48)+20)-(((BA48*BC48)+20)*($AV$53-(BO48+30))/BR48)","v":{"$error":"#N/A"}},15,15.1,30.1,39.9,75,105,125,20,0,1.36,{"$error":"#N/A"},{"$error":"#N/A"}]
[{"$nulls":38},4,8,15,30,{"$nulls":8},"Corn silage","Ton",{"$error":"#N/A"},3.3,8,{"$error":"#VALUE!"},{"$error":"#N/A"},{"$error":"#N/A"},0,{"$error":"#N/A"},{"$f":"((BA49*BC49)+20)-(((BA49*BC49)+20)*($AV$35-BO49)/BR49)","v":{"$error":"#N/A"}},{"$f":"((BA49*BC49)+20)-(((BA49*BC49)+20)*($AV$53-BO49)/BR49)","v":{"$error":"#N/A"}},15,15.1,30.1,39.9,75,105,125,50,0,9.4,{"$error":"#N/A"},{"$error":"#N/A"}]
[{"$nulls":38},5,10,16,32,{"$nulls":8},"Grass pasture","Ton",{"$error":"#N/A"},13,50,{"$error":"#VALUE!"},{"$error":"#N/A"},{"$error":"#N/A"},0,{"$error":"#N/A"},{"$error":"#N/A"},{"$f":"((BA50*BC50)+20)-(((BA50*BC50)+20)*($AV$53-BO50)/BR50)","v":{"$error":"#N/A"}},25,25.1,40.1,49.9,75,105,125,50,40,40,{"$error":"#N/A"},{"$error":"#N/A"}]
[{"$nulls":38},6,12,17,34,null,null,"Recommendations",{"$nulls":5},"Legume pasture","Ton",{"$error":"#N/A"},13,50,{"$error":"#VALUE!"},{"$error":"#N/A"},{"$error":"#N/A"},0,{"$error":"#N/A"},{"$error":"#N/A"},{"$f":"((BA51*BC51)+20)-(((BA51*BC51)+20)*($AV$35-BO51)/BR51)","v":{"$error":"#N/A"}},25,25.1,40.1,49.9,75,105,125,50,100,40,{"$error":"#N/A"},{"$error":"#N/A"}]
[{"$nulls":38},7,14,18,36,{"$nulls":4},"P","K","CEC","N Rec","Oats","Bu",{"$error":"#N/A"},0.25,0.19,{"$error":"#VALUE!"},{"$error":"#N/A"},{"$error":"#N/A"},0,{"$error":"#N/A"},{"$f":"(BA52*BC52)+20","v":{"$error":"#N/A"}},{"$f":"((BA52*BC52)+20)-(((BA52*BC52)+20)*($AV$53-(BO52+30))/BR52)","v":{"$error":"#N/A"}},25,25.1,40.1,49.9,75,105,125,20,0,0.7,{"$error":"#N/A"},{"$error":"#N/A"}]
[{"$nulls":38},8,16,19,38,{"$nulls":4},{"$f":"IFERROR(IF(AND($E$8=\"Bray P1\",$E$10=\"ppm\"),$R$10,IF(AND($E$8=\"Bray P1\",$E$10=\"lb/ac\"),($R$10/2),IF(AND($E$8=\"Mehlich III\",$E$10=\"ppm\"),INDEX(VRTConversion,MATCH((ROUND($R$10,0)),$AO$45:AO284,0),1),INDEX(VRTConversion,MATCH(ROUND($R$10/2,0),$AO$45:AO284,0),1)))),IF(R10>0,1,\"\"))","v":""},{"$f":"IF(E10=\"ppm\",T10,T10/2)","v":0},{"$f":"P10","v":{"v":0,"d":"0.0"}},null,"Rye","Bu",{"$error":"#N/A"},0.64,0.36,{"$error":"#VALUE!"},{"$error":"#N/A"},{"$error":"#N/A"},0,{"$error":"#N/A"},{"$f":"(BA53*BC53)+20","v":{"$error":"#N/A"}},{"$f":"((BA53*BC53)+20)-(((BA53*BC53)+20)*($AV$53-(BO53+30))/BR53)","v":{"$error":"#N/A"}},25,25.1,40.1,49.9,75,105,125,20,0,1.3,{"$f":"40+(1.75*(BA53-50))","v":{"$error":"#N/A"}},{"$error":"#N/A"}]
[{"$nulls":38},9,18,20,40,null,null,{"$f":"$D$13","v":0},{"$f":"$G$13","v":0},{"$f":"IF($AU$53<=VLOOKUP($AS54,Reference2,13),\"P Buildup\",IF(AND($AU$53>=VLOOKUP($AS54,Reference2,14),$AU$53<=VLOOKUP($AS54,Reference2,15)),\"P Maintenance\",IF(AND($AU$53>VLOOKUP($AS54,Reference2,15),($AU$53<VLOOKUP($AS54,Reference2,16))),\"P Drawdown\", \"No Apply\")))","v":{"$error":"#N/A"}},{"$f":"IF($AV$53>=VLOOKUP($AS54,$AY$45:$BV$60,19),\"No Apply\",IF($AV$53<=VLOOKUP($AS54,$AY$45:$BV$60,17), \"K Buildup\", IF(AND($AV$53>=VLOOKUP($AS54,$AY$45:$BV$60,17),($AV$53<=(VLOOKUP($AS54,$AY$45:$BV$60,18)-0.1))), \"K Maintenance\", \"K Drawdown\")))","v":{"$error":"#N/A"}},{"$f":"IFERROR(IF(OR($AS53=\"Wheat\",$AS53=\"Wheat w/ Stover\",$AS53=\"Rye\",$AS53=\"Spelt\"),0,INDEX($AY$28:$BU$42,MATCH($AS53,Crop,0),21)),0)","v":0},{"$f":"(INDEX($AY$28:$BU$42,MATCH(AS54,Crop,0),23))-AW54","v":{"$error":"#N/A"}},"Sorghum","Bu",{"$error":"#N/A"},0.22,0.22,{"$error":"#VALUE!"},{"$error":"#N/A"},{"$error":"#N/A"},0,{"$error":"#N/A"},{"$error":"#N/A"},{"$error":"#N/A"},15,15.1,30.1,39.9,75,105,125,20,0,0.7,{"$f":"-27+(BT54*BA54)","v":{"$error":"#N/A"}},{"$error":"#N/A"}]
[{"$nulls":38},9,18,21,42,null,null,{"$f":"$D$14","v":0},{"$f":"$G$14","v":0},{"$f":"IF($AU$53<=VLOOKUP($AS55,Reference2,13),\"P Buildup\",IF(AND($AU$53>=VLOOKUP($AS55,Reference2,14),$AU$53<=VLOOKUP($AS55,Reference2,15)),\"P Maintenance\",IF(AND($AU$53>VLOOKUP($AS55,Reference2,15),($AU$53<VLOOKUP($AS55,Reference2,16))),\"P Drawdown\", \"No Apply\")))","v":{"$error":"#N/A"}},{"$f":"IF($AV$53>=VLOOKUP($AS55,$AY$45:$BV$60,19),\"No Apply\",IF($AV$53<=VLOOKUP($AS55,$AY$45:$BV$60,17), \"K Buildup\", IF(AND($AV$53>=VLOOKUP($AS55,$AY$45:$BV$60,17),($AV$53<=(VLOOKUP($AS55,$AY$45:$BV$60,18)-0.1))), \"K Maintenance\", \"K Drawdown\")))","v":{"$error":"#N/A"}},{"$f":"IFERROR(IF(OR($AS54=\"Wheat\",$AS54=\"Wheat w/ Stover\",$AS54=\"Rye\",$AS54=\"Spelt\"),0,INDEX($AY$28:$BU$42,MATCH($AS54,Crop,0),21)),0)","v":0},{"$f":"(INDEX($AY$28:$BU$42,MATCH(AS55,Crop,0),23))-AW55","v":{"$error":"#N/A"}},"Sorghum-sudan forage","Ton",{"$error":"#N/A"},4.6,18,{"$error":"#VALUE!"},{"$error":"#N/A"},{"$error":"#N/A"},0,{"$error":"#N/A"},{"$error":"#N/A"},{"$f":"((BA55*BC55)+20)-(((BA55*BC55)+20)*($AV$53-BO55)/BR55)","v":{"$error":"#N/A"}},25,25.1,40.1,49.9,75,105,125,50,0,40,{"$f":"-27+(BT55*BA55)","v":{"$error":"#N/A"}},{"$error":"#N/A"}]
[{"$nulls":38},10,20,22,44,null,null,{"$f":"$D$15","v":0},{"$f":"$G$15","v":0},{"$f":"IF($AU$53<=VLOOKUP($AS56,Reference2,13),\"P Buildup\",IF(AND($AU$53>=VLOOKUP($AS56,Reference2,14),$AU$53<=VLOOKUP($AS56,Reference2,15)),\"P Maintenance\",IF(AND($AU$53>VLOOKUP($AS56,Reference2,15),($AU$53<VLOOKUP($AS56,Reference2,16))),\"P Drawdown\", \"No Apply\")))","v":{"$error":"#N/A"}},{"$error":"#N/A"},{"$f":"IFERROR(IF(OR($AS55=\"Wheat\",$AS55=\"Wheat w/ Stover\",$AS55=\"Rye\",$AS55=\"Spelt\"),0,INDEX($AY$28:$BU$42,MATCH($AS55,Crop,0),21)),0)","v":0},{"$f":"(INDEX($AY$28:$BU$42,MATCH(AS56,Crop,0),23))-AW56","v":{"$error":"#N/A"}},"Soybean","Bu",{"$error":"#N/A"},0.8,1.4,{"$error":"#VALUE!"},{"$error":"#N/A"},{"$error":"#N/A"},0,{"$error":"#N/A"},{"$f":"(BA56*BC56)+20","v":{"$error":"#N/A"}},{"$f":"((BA56*BC56)+20)-(((BA56*BC56)+20)*($AV$53-(BO56+30))/BR56)","v":{"$error":"#N/A"}},15,15.1,30.1,39.9,75,105,125,20,30,3.8,null,{"$f":"MIN((BT56*BA56),150)","v":{"$error":"#N/A"}}]
[{"$nulls":38},11,22,23,46,null,null,{"$f":"$D$16","v":0},{"$f":"$G$16","v":0},{"$f":"IF($AU$53<=VLOOKUP($AS57,Reference2,13),\"P Buildup\",IF(AND($AU$53>=VLOOKUP($AS57,Reference2,14),$AU$53<=VLOOKUP($AS57,Reference2,15)),\"P Maintenance\",IF(AND($AU$53>VLOOKUP($AS57,Reference2,15),($AU$53<VLOOKUP($AS57,Reference2,16))),\"P Drawdown\", \"No Apply\")))","v":{"$error":"#N/A"}},{"$error":"#N/A"},{"$f":"IFERROR(IF(OR($AS56=\"Wheat\",$AS56=\"Wheat w/ Stover\",$AS56=\"Rye\",$AS56=\"Spelt\"),0,INDEX($AY$28:$BU$42,MATCH($AS56,Crop,0),21)),0)","v":0},{"$f":"(INDEX($AY$28:$BU$42,MATCH(AS57,Crop,0),23))-AW57","v":{"$error":"#N/A"}},"Spelt","Bu",{"$error":"#N/A"},0.63,0.37,{"$error":"#VALUE!"},{"$error":"#N/A"},{"$f":"($BE57-($BE57*($AU$53-($BK57+15))/10))","v":{"$error":"#N/A"}},0,{"$error":"#N/A"},{"$f":"(BA57*BC57)+20","v":{"$error":"#N/A"}},{"$f":"((BA57*BC57)+20)-(((BA57*BC57)+20)*($AV$53-(BO57+30))/BR57)","v":{"$error":"#N/A"}},25,25.1,40.1,49.9,75,105,125,20,0,1.3,{"$f":"-27+(BT57*BA57)","v":{"$error":"#N/A"}},{"$f":"BU57","v":{"$error":"#N/A"}}]
[{"$nulls":38},12,24,24,48,{"$nulls":6},"N Credit",null,"Tomato ","Ton",{"$error":"#N/A"},2.18,7,{"$f":"((($BK58-$AU$53)*5)+(BE58))","v":{"$error":"#VALUE!"}},{"$f":"BA58*BB58","v":{"$error":"#N/A"}},{"$f":"($BE58-($BE58*($AU$53-($BK58+15))/10))","v":{"$error":"#N/A"}},1,{"$f":"(($BO58-$AV$53)*((1+(0.05*$AW$53)))+(BA58*BC58)+20)","v":{"$error":"#N/A"}},{"$f":"(BA58*BC58)+20","v":{"$error":"#N/A"}},{"$f":"((BA58*BC58)+20)-(((BA58*BC58)+20)*($AV$53-(BO58+30))/BR58)","v":{"$error":"#N/A"}},45,45.1,80,80.1,{"$f":"75+(2.5*$AP$35)","v":75},105,125,20,0,null,80]
[{"$nulls":38},13,26,25,50,{"$nulls":8},"Wheat","Bu",{"$error":"#N/A"},0.63,0.37,{"$error":"#VALUE!"},{"$f":"BA59*BB59","v":{"$error":"#N/A"}},{"$error":"#N/A"},0,{"$error":"#N/A"},{"$error":"#N/A"},{"$error":"#N/A"},25,25.1,{"$f":"BK59+15.1","v":40.1},49.9,75,105,125,20,0,1.3,{"$f":"40+(1.75*(BA59-50))","v":{"$error":"#N/A"}},{"$f":"BU59","v":{"$error":"#N/A"}}]
[{"$nulls":38},14,28,26,52,{"$nulls":8},"Wheat w/Stover","Bu",{"$error":"#N/A"},0.72,1.28,{"$error":"#VALUE!"},{"$f":"BA60*BB60","v":{"$error":"#N/A"}},{"$error":"#N/A"},0,{"$error":"#N/A"},{"$error":"#N/A"},{"$error":"#N/A"},25,25.1,{"$f":"BK60+15.1","v":40.1},49.9,75,105,125,20,0,1.3,{"$f":"40+(1.75*(BA60-50))","v":{"$error":"#N/A"}},{"$f":"BU60","v":{"$error":"#N/A"}}]
[{"$nulls":38},14,28,27,54]
[{"$nulls":38},15,30,28,56,{"$nulls":8},1,2,3,4,5,6,7,8,9,10,11,12,13,14,15,16,17,18,19,20,21,22,23,24]
[{"$nulls":38},16,32,29,58,{"$nulls":9},"Unit","YP","P","K","P Buildup","P Maintenance","P Drawdown","No Apply","K Buildup","K Maintenance","K Drawdown","P Critical Level","P Maintenance Top Level","P Maintenance Top Level","P Upper Level","K CL","K ML","K DL","K Divisor","N Credit","NRemoval","NRx","Max N"]
[{"$nulls":38},17,34,30,60,{"$nulls":8},"Alfalfa","Ton",{"$f":"INDEX($AS$72:$AT$75,MATCH($AY64,$AS$36:$AS$39,0),2)","v":{"$error":"#N/A"}},13,50,{"$f":"((($BK64-$AU$71)*5)+(BE64))","v":{"$error":"#VALUE!"}},{"$f":"BA64*BB64","v":{"$error":"#N/A"}},{"$f":"($BE64-($BE64*($AU$71-($BK64+15))/10))","v":{"$error":"#N/A"}},0,{"$f":"(($BO64-$AV$71)*((1+(0.05*$AW$71)))+(BA64*BC64)+20)","v":{"$error":"#N/A"}},{"$f":"((BA64*BC64)+20)-(((BA64*BC64)+20)*($AV$71-BO64)/BR64)","v":{"$error":"#N/A"}},{"$f":"((BA64*BC64)+20)-(((BA64*BC64)+20)*($AV$71-BO64)/BR64)","v":{"$error":"#N/A"}},25,{"$f":"BK64+0.1","v":25.1},{"$f":"BK64+15.1","v":40.1},{"$f":"BK64+24.9","v":49.9},{"$f":"75+(2.5*$AW$71)","v":75},{"$f":"BO64+30","v":105},{"$f":"BO64+50","v":125},50,140,40,null,{"$f":"MIN((BT64*BA64),150)","v":{"$error":"#N/A"}}]
[{"$nulls":38},18,36,31,62,{"$nulls":8},"Barley","Bu",{"$f":"INDEX($AS$72:$AT$75,MATCH($AY65,$AS$36:$AS$39,0),2)","v":{"$error":"#N/A"}},0.25,0.2,{"$f":"((($BK65-$AU$71)*5)+(BE65))","v":{"$error":"#VALUE!"}},{"$f":"BA65*BB65","v":{"$error":"#N/A"}},{"$f":"($BE65-($BE65*($AU$71-($BK65+15))/10))","v":{"$error":"#N/A"}},0,{"$f":"(($BO65-$AV$71)*((1+(0.05*$AW$71)))+(BA65*BC65)+20)","v":{"$error":"#N/A"}},{"$f":"(BA65*BC65)+20","v":{"$error":"#N/A"}},{"$f":"((BA65*BC65)+20)-(((BA65*BC65)+20)*($AV$71-(BO65+30))/BR65)","v":{"$error":"#N/A"}},25,{"$f":"BK65+0.1","v":25.1},{"$f":"BK65+15.1","v":40.1},{"$f":"BK65+24.9","v":49.9},{"$f":"75+(2.5*$AW$71)","v":75},{"$f":"BO65+30","v":105},{"$f":"BO65+50","v":125},20,0,1,{"$f":"-27+(BT65*BA65)","v":{"$error":"#N/A"}},{"$f":"BU65","v":{"$error":"#N/A"}}]
[{"$nulls":38},19,38,32,64,{"$nulls":8},"Corn","Bu",{"$error":"#N/A"},0.37,0.27,{"$error":"#VALUE!"},{"$f":"BA66*BB66","v":{"$error":"#N/A"}},{"$error":"#N/A"},0,{"$error":"#N/A"},{"$f":"(BA66*BC66)+20","v":{"$error":"#N/A"}},{"$f":"((BA66*BC66)+20)-(((BA66*BC66)+20)*($AV$71-(BO66+30))/BR66)","v":{"$error":"#N/A"}},15,15.1,30.1,39.9,75,105,125,20,0,1.36,{"$error":"#N/A"},{"$error":"#N/A"}]
[{"$nulls":38},19,38,33,66,{"$nulls":8},"Corn silage","Ton",{"$error":"#N/A"},3.3,8,{"$error":"#VALUE!"},{"$error":"#N/A"},{"$error":"#N/A"},0,{"$error":"#N/A"},{"$f":"((BA67*BC67)+20)-(((BA67*BC67)+20)*($AV$71-BO67)/BR67)","v":{"$error":"#N/A"}},{"$f":"((BA67*BC67)+20)-(((BA67*BC67)+20)*($AV$71-BO67)/BR67)","v":{"$error":"#N/A"}},15,15.1,30.1,39.9,75,105,125,50,0,9.4,{"$error":"#N/A"},{"$error":"#N/A"}]
[{"$nulls":38},20,40,34,68,{"$nulls":8},"Grass pasture","Ton",{"$error":"#N/A"},13,50,{"$error":"#VALUE!"},{"$error":"#N/A"},{"$error":"#N/A"},0,{"$error":"#N/A"},{"$f":"((BA68*BC68)+20)-(((BA68*BC68)+20)*($AV$71-BO68)/BR68)","v":{"$error":"#N/A"}},{"$f":"((BA68*BC68)+20)-(((BA68*BC68)+20)*($AV$71-BO68)/BR68)","v":{"$error":"#N/A"}},25,25.1,40.1,49.9,75,105,125,50,40,40,{"$error":"#N/A"},{"$error":"#N/A"}]
[{"$nulls":38},21,42,35,70,null,null,"Recommendations",{"$nulls":5},"Legume pasture","Ton",{"$error":"#N/A"},13,50,{"$error":"#VALUE!"},{"$error":"#N/A"},{"$error":"#N/A"},0,{"$error":"#N/A"},{"$error":"#N/A"},{"$error":"#N/A"},25,25.1,40.1,49.9,75,105,125,50,100,40,{"$error":"#N/A"},{"$error":"#N/A"}]
[{"$nulls":38},22,44,36,72,{"$nulls":4},"P","K","CEC","N Rec","Oats","Bu",{"$error":"#N/A"},0.25,0.19,{"$error":"#VALUE!"},{"$error":"#N/A"},{"$error":"#N/A"},0,{"$error":"#N/A"},{"$f":"(BA70*BC70)+20","v":{"$error":"#N/A"}},{"$f":"((BA70*BC70)+20)-(((BA70*BC70)+20)*($AV$71-(BO70+30))/BR70)","v":{"$error":"#N/A"}},25,25.1,40.1,49.9,75,105,125,20,0,0.7,{"$error":"#N/A"},{"$error":"#N/A"}]
[{"$nulls":38},23,46,37,74,{"$nulls":4},{"$f":"IFERROR(IF(AND($E$8=\"Bray P1\",$E$10=\"ppm\"),$X$10,IF(AND($E$8=\"Bray P1\",$E$10=\"lb/ac\"),($X$10/2),IF(AND($E$8=\"Mehlich III\",$E$10=\"ppm\"),INDEX(VRTConversion,MATCH((ROUND($X$10,0)),$AO$45:AO284,0),1),INDEX(VRTConversion,MATCH(ROUND($X$10/2,0),$AO$45:AO284,0),1)))),IF(X10>0,1,\"\"))","v":""},{"$f":"IF(E10=\"ppm\",Z10,Z10/2)","v":0},{"$f":"V10","v":{"v":0,"d":"0.0"}},null,"Rye","Bu",{"$error":"#N/A"},0.64,0.36,{"$error":"#VALUE!"},{"$error":"#N/A"},{"$error":"#N/A"},0,{"$error":"#N/A"},{"$f":"(BA71*BC71)+20","v":{"$error":"#N/A"}},{"$f":"((BA71*BC71)+20)-(((BA71*BC71)+20)*($AV$71-(BO71+30))/BR71)","v":{"$error":"#N/A"}},25,25.1,40.1,49.9,75,105,125,20,0,1.3,{"$f":"40+(1.75*(BA71-50))","v":{"$error":"#N/A"}},{"$error":"#N/A"}]
[{"$nulls":38},24,48,38,76,null,null,{"$f":"$D$13","v":0},{"$f":"$G$13","v":0},{"$f":"IF($AU$71<=VLOOKUP($AS72,Reference3,13),\"P Buildup\",IF(AND($AU$71>=VLOOKUP($AS72,Reference3,14),$AU$71<=VLOOKUP($AS72,Reference3,15)),\"P Maintenance\",IF(AND($AU$71>VLOOKUP($AS72,Reference3,15),($AU$71<VLOOKUP($AS72,Reference3,16))),\"P Drawdown\", \"No Apply\")))","v":{"$error":"#N/A"}},{"$f":"IF($AV$71>=VLOOKUP($AS72,$AY$63:$BV$78,19),\"No Apply\",IF($AV$71<=VLOOKUP($AS72,$AY$63:$BV$78,17), \"K Buildup\", IF(AND($AV$71>=VLOOKUP($AS72,$AY$63:$BV$78,17),($AV$71<=(VLOOKUP($AS72,$AY$63:$BV$78,18)-0.1))), \"K Maintenance\", \"K Drawdown\")))","v":{"$error":"#N/A"}},{"$f":"IFERROR(IF(OR($AS71=\"Wheat\",$AS71=\"Wheat w/ Stover\",$AS71=\"Rye\",$AS71=\"Spelt\"),0,INDEX($AY$28:$BU$42,MATCH($AS71,Crop,0),21)),0)","v":0},{"$f":"(INDEX($AY$28:$BU$42,MATCH(AS72,Crop,0),23))-AW72","v":{"$error":"#N/A"}},"Sorghum","Bu",{"$error":"#N/A"},0.22,0.22,{"$error":"#VALUE!"},{"$error":"#N/A"},{"$error":"#N/A"},0,{"$error":"#N/A"},{"$error":"#N/A"},{"$error":"#N/A"},15,15.1,30.1,39.9,75,105,125,20,0,0.7,{"$f":"-27+(BT72*BA72)","v":{"$error":"#N/A"}},{"$error":"#N/A"}]
[{"$nulls":38},24,48,39,78,null,null,{"$f":"$D$14","v":0},{"$f":"$G$14","v":0},{"$f":"IF($AU$71<=VLOOKUP($AS73,Reference3,13),\"P Buildup\",IF(AND($AU$71>=VLOOKUP($AS73,Reference3,14),$AU$71<=VLOOKUP($AS73,Reference3,15)),\"P Maintenance\",IF(AND($AU$71>VLOOKUP($AS73,Reference3,15),($AU$71<VLOOKUP($AS73,Reference3,16))),\"P Drawdown\", \"No Apply\")))","v":{"$error":"#N/A"}},{"$f":"IF($AV$71>=VLOOKUP($AS73,$AY$63:$BV$78,19),\"No Apply\",IF($AV$71<=VLOOKUP($AS73,$AY$63:$BV$78,17), \"K Buildup\", IF(AND($AV$71>=VLOOKUP($AS73,$AY$63:$BV$78,17),($AV$71<=(VLOOKUP($AS73,$AY$63:$BV$78,18)-0.1))), \"K Maintenance\", \"K Drawdown\")))","v":{"$error":"#N/A"}},{"$f":"IFERROR(IF(OR($AS72=\"Wheat\",$AS72=\"Wheat w/ Stover\",$AS72=\"Rye\",$AS72=\"Spelt\"),0,INDEX($AY$28:$BU$42,MATCH($AS72,Crop,0),21)),0)","v":0},{"$f":"(INDEX($AY$28:$BU$42,MATCH(AS73,Crop,0),23))-AW73","v":{"$error":"#N/A"}},"Sorghum-sudan forage","Ton",{"$error":"#N/A"},4.6,18,{"$error":"#VALUE!"},{"$error":"#N/A"},{"$error":"#N/A"},0,{"$error":"#N/A"},{"$error":"#N/A"},{"$f":"((BA73*BC73)+20)-(((BA73*BC73)+20)*($AV$71-BO73)/BR73)","v":{"$error":"#N/A"}},25,25.1,40.1,49.9,75,105,125,50,0,40,{"$f":"-27+(BT73*BA73)","v":{"$error":"#N/A"}},{"$error":"#N/A"}]
[{"$nulls":38},25,50,40,80,null,null,{"$f":"$D$15","v":0},{"$f":"$G$15","v":0},{"$f":"IF($AU$71<=VLOOKUP($AS74,Reference3,13),\"P Buildup\",IF(AND($AU$71>=VLOOKUP($AS74,Reference3,14),$AU$71<=VLOOKUP($AS74,Reference3,15)),\"P Maintenance\",IF(AND($AU$71>VLOOKUP($AS74,Reference3,15),($AU$71<VLOOKUP($AS74,Reference3,16))),\"P Drawdown\", \"No Apply\")))","v":{"$error":"#N/A"}},{"$f":"IF($AV$71>=VLOOKUP($AS74,$AY$63:$BV$78,19),\"No Apply\",IF($AV$71<=VLOOKUP($AS74,$AY$63:$BV$78,17), \"K Buildup\", IF(AND($AV$71>=VLOOKUP($AS74,$AY$63:$BV$78,17),($AV$71<=(VLOOKUP($AS74,$AY$63:$BV$78,18)-0.1))), \"K Maintenance\", \"K Drawdown\")))","v":{"$error":"#N/A"}},{"$f":"IFERROR(IF(OR($AS73=\"Wheat\",$AS73=\"Wheat w/ Stover\",$AS73=\"Rye\",$AS73=\"Spelt\"),0,INDEX($AY$28:$BU$42,MATCH($AS73,Crop,0),21)),0)","v":0},{"$f":"(INDEX($AY$28:$BU$42,MATCH(AS74,Crop,0),23))-AW74","v":{"$error":"#N/A"}},"Soybean","Bu",{"$error":"#N/A"},0.8,1.4,{"$error":"#VALUE!"},{"$error":"#N/A"},{"$error":"#N/A"},0,{"$error":"#N/A"},{"$f":"(BA74*BC74)+20","v":{"$error":"#N/A"}},{"$f":"((BA74*BC74)+20)-(((BA74*BC74)+20)*($AV$71-(BO74+30))/BR74)","v":{"$error":"#N/A"}},15,15.1,30.1,39.9,75,105,125,20,30,3.8,null,{"$f":"MIN((BT74*BA74),150)","v":{"$error":"#N/A"}}]
[{"$nulls":38},26,52,41,82,null,null,{"$f":"$D$16","v":0},{"$f":"$G$16","v":0},{"$f":"IF($AU$71<=VLOOKUP($AS75,Reference3,13),\"P Buildup\",IF(AND($AU$71>=VLOOKUP($AS75,Reference3,14),$AU$71<=VLOOKUP($AS75,Reference3,15)),\"P Maintenance\",IF(AND($AU$71>VLOOKUP($AS75,Reference3,15),($AU$71<VLOOKUP($AS75,Reference3,16))),\"P Drawdown\", \"No Apply\")))","v":{"$error":"#N/A"}},{"$error":"#N/A"},{"$f":"IFERROR(IF(OR($AS74=\"Wheat\",$AS74=\"Wheat w/ Stover\",$AS74=\"Rye\",$AS74=\"Spelt\"),0,INDEX($AY$28:$BU$42,MATCH($AS74,Crop,0),21)),0)","v":0},{"$f":"(INDEX($AY$28:$BU$42,MATCH(AS75,Crop,0),23))-AW75","v":{"$error":"#N/A"}},"Spelt","Bu",{"$error":"#N/A"},0.63,0.37,{"$error":"#VALUE!"},{"$error":"#N/A"},{"$error":"#N/A"},0,{"$error":"#N/A"},{"$f":"(BA75*BC75)+20","v":{"$error":"#N/A"}},{"$f":"((BA75*BC75)+20)-(((BA75*BC75)+20)*($AV$71-(BO75+30))/BR75)","v":{"$error":"#N/A"}},25,25.1,40.1,49.9,75,105,125,20,0,1.3,{"$f":"-27+(BT75*BA75)","v":{"$error":"#N/A"}},{"$f":"BU75","v":{"$error":"#N/A"}}]
[{"$nulls":38},27,54,42,84,{"$nulls":6},"N Credit",null,"Tomato ","Ton",{"$error":"#N/A"},2.18,7,{"$error":"#VALUE!"},{"$f":"BA76*BB76","v":{"$error":"#N/A"}},{"$error":"#N/A"},1,{"$f":"(($BO76-$AV$71)*((1+(0.05*$AW$71)))+(BA76*BC76)+20)","v":{"$error":"#N/A"}},{"$f":"(BA76*BC76)+20","v":{"$error":"#N/A"}},{"$f":"((BA76*BC76)+20)-(((BA76*BC76)+20)*($AV$71-(BO76+30))/BR76)","v":{"$error":"#N/A"}},45,45.1,80,80.1,{"$f":"75+(2.5*$AP$35)","v":75},105,125,20,0,null,80]
[{"$nulls":38},28,56,43,86,{"$nulls":8},"Wheat","Bu",{"$error":"#N/A"},0.63,0.37,{"$error":"#VALUE!"},{"$f":"BA77*BB77","v":{"$error":"#N/A"}},{"$error":"#N/A"},0,{"$error":"#N/A"},{"$error":"#N/A"},{"$error":"#N/A"},25,25.1,{"$f":"BK77+15.1","v":40.1},49.9,75,105,125,20,0,1.3,{"$f":"40+(1.75*(BA77-50))","v":{"$error":"#N/A"}},{"$f":"BU77","v":{"$error":"#N/A"}}]
[{"$nulls":38},29,58,44,88,{"$nulls":8},"Wheat w/Stover","Bu",{"$error":"#N/A"},0.72,1.28,{"$error":"#VALUE!"},{"$f":"BA78*BB78","v":{"$error":"#N/A"}},{"$error":"#N/A"},0,{"$error":"#N/A"},{"$error":"#N/A"},{"$error":"#N/A"},25,25.1,{"$f":"BK78+15.1","v":40.1},49.9,75,105,125,20,0,1.3,{"$f":"40+(1.75*(BA78-50))","v":{"$error":"#N/A"}},{"$f":"BU78","v":{"$error":"#N/A"}}]
[{"$nulls":38},29,58,45,90]
[{"$nulls":38},30,60,46,92,null,null,"County",null,"Recommendation",null,null,"P Rx","K Rx","P Rx","K Rx","P Rx","K Rx","P Rate","K Rate","P Rate","K Rate","P Rate","K Rate"]
[{"$nulls":38},31,62,47,94,null,null,"Adams",null,{"$f":"A17","v":""},"Nutrient Credits",null,{"$f":"$L$17","v":0},{"$f":"$N$17","v":0}]
[{"$nulls":38},32,64,48,96,null,null,"Allen",null,0,null,{"$f":"IFERROR(INDEX(CommonFert,MATCH(AU82,FertList,0),6),\"\")","v":""},{"$f":"MAX(0,$L$13-($AX$81))","v":0},{"$f":"MAX(0,$N$13-($AY$81))","v":0},{"$f":"MAX(0,$R$13-($AX$81))","v":0},{"$f":"MAX(0,$T$13-($AY$81))","v":0},{"$f":"MAX(0,$X$13-($AX$81))","v":0},{"$f":"MAX(0,$Z$13-($AY$81))","v":0},{"$f":"IF(INDEX($BF$3:$BK$17,MATCH($AU82,$BF$3:$BF$17,0),6)=\"gal.\",AX82/(INDEX($BF$3:$BK$17,MATCH($AU82,$BF$3:$BF$17,0),4))/(INDEX($BF$3:$BK$17,MATCH($AU82,$BF$3:$BF$17,0),2)),AX82/(INDEX($BF$3:$BK$17,MATCH($AU82,$BF$3:$BF$17,0),4)))","v":{"$error":"#N/A"}},{"$f":"IF(INDEX($BF$3:$BK$17,MATCH($AU82,$BF$3:$BF$17,0),6)=\"gal.\",AY82/(INDEX($BF$3:$BK$17,MATCH($AU82,$BF$3:$BF$17,0),5))/(INDEX($BF$3:$BK$17,MATCH($AU82,$BF$3:$BF$17,0),2)),AY82/(INDEX($BF$3:$BK$17,MATCH($AU82,$BF$3:$BF$17,0),5)))","v":{"$error":"#N/A"}},{"$f":"IF(INDEX($BF$3:$BK$17,MATCH($AU82,$BF$3:$BF$17,0),6)=\"gal.\",AZ82/(INDEX($BF$3:$BK$17,MATCH($AU82,$BF$3:$BF$17,0),4))/(INDEX($BF$3:$BK$17,MATCH($AU82,$BF$3:$BF$17,0),2)),AZ82/(INDEX($BF$3:$BK$17,MATCH($AU82,$BF$3:$BF$17,0),4)))","v":{"$error":"#N/A"}},{"$f":"IF(INDEX($BF$3:$BK$17,MATCH($AU82,$BF$3:$BF$17,0),6)=\"gal.\",BA82/(INDEX($BF$3:$BK$17,MATCH($AU82,$BF$3:$BF$17,0),5))/(INDEX($BF$3:$BK$17,MATCH($AU82,$BF$3:$BF$17,0),2)),BA82/(INDEX($BF$3:$BK$17,MATCH($AU82,$BF$3:$BF$17,0),5)))","v":{"$error":"#N/A"}},{"$f":"IF(INDEX($BF$3:$BK$17,MATCH($AU82,$BF$3:$BF$17,0),6)=\"gal.\",BB82/(INDEX($BF$3:$BK$17,MATCH($AU82,$BF$3:$BF$17,0),4))/(INDEX($BF$3:$BK$17,MATCH($AU82,$BF$3:$BF$17,0),2)),BB82/(INDEX($BF$3:$BK$17,MATCH($AU82,$BF$3:$BF$17,0),4)))","v":{"$error":"#N/A"}},{"$f":"IF(INDEX($BF$3:$BK$17,MATCH($AU82,$BF$3:$BF$17,0),6)=\"gal.\",BC82/(INDEX($BF$3:$BK$17,MATCH($AU82,$BF$3:$BF$17,0),5))/(INDEX($BF$3:$BK$17,MATCH($AU82,$BF$3:$BF$17,0),2)),BC82/(INDEX($BF$3:$BK$17,MATCH($AU82,$BF$3:$BF$17,0),5)))","v":{"$error":"#N/A"}}]
[{"$nulls":38},33,66,49,98,null,null,"Ashland",null,0,null,"",{"$f":"MAX(0,$L$13-($AX$81))","v":0},{"$f":"MAX(0,$N$13-($AY$81))","v":0},{"$f":"MAX(0,$R$13-($AX$81))","v":0},{"$f":"MAX(0,$T$13-($AY$81))","v":0},{"$f":"MAX(0,$X$13-($AX$81))","v":0},{"$f":"MAX(0,$Z$13-($AY$81))","v":0},{"$f":"IF(INDEX($BF$3:$BK$17,MATCH(AU83,$BF$3:$BF$17,0),6)=\"gal.\",AX83/(INDEX($BF$3:$BK$17,MATCH(AU83,$BF$3:$BF$17,0),4))/(INDEX($BF$3:$BK$17,MATCH(AU83,$BF$3:$BF$17,0),2)),AX83/(INDEX($BF$3:$BK$17,MATCH(AU83,$BF$3:$BF$17,0),4)))","v":{"$error":"#N/A"}},{"$error":"#N/A"},{"$error":"#N/A"},{"$error":"#N/A"},{"$error":"#N/A"},{"$error":"#N/A"}]
[{"$nulls":38},34,68,50,100,null,null,"Ashtabula",null,"","Nutrient Credits","",{"$f":"$L$20","v":0},{"$f":"$N$20","v":0},{"$nulls":4},{"$error":"#N/A"},{"$error":"#N/A"},{"$error":"#N/A"},{"$error":"#N/A"},{"$error":"#N/A"},{"$error":"#N/A"}]
[{"$nulls":38},34,68,51,102,null,null,"Athens",null,0,null,"",{"$f":"MAX(0,$L$14-($AX$84))","v":0},{"$f":"MAX(0,$N$14-($AY$84))","v":0},{"$f":"MAX(0,$R$14-($AX$84))","v":0},{"$f":"MAX(0,$T$14-($AY$84))","v":0},{"$f":"MAX(0,$X$14-($AX$84))","v":0},{"$f":"MAX(0,$Z$14-($AY$84))","v":0},{"$error":"#N/A"},{"$error":"#N/A"},{"$error":"#N/A"},{"$error":"#N/A"},{"$error":"#N/A"},{"$error":"#N/A"}]
[{"$nulls":38},35,70,52,104,null,null,"Auglaize",null,0,null,"",{"$f":"MAX(0,$L$14-($AX$84))","v":0},{"$f":"MAX(0,$N$14-($AY$84))","v":0},{"$f":"MAX(0,$R$14-($AX$84))","v":0},{"$f":"MAX(0,$T$14-($AY$84))","v":0},{"$f":"MAX(0,$X$14-($AX$84))","v":0},{"$f":"MAX(0,$Z$14-($AY$84))","v":0},{"$error":"#N/A"},{"$error":"#N/A"},{"$error":"#N/A"},{"$error":"#N/A"},{"$error":"#N/A"},{"$error":"#N/A"}]
[{"$nulls":38},36,72,53,106,null,null,"Belmont",null,"","Nutrient Credits","",{"$f":"$L$23","v":0},{"$f":"$N$23","v":0},{"$nulls":4},{"$error":"#N/A"},{"$error":"#N/A"},{"$error":"#N/A"},{"$error":"#N/A"},{"$error":"#N/A"},{"$error":"#N/A"}]
[{"$nulls":38},37,74,54,108,null,null,"Brown",null,0,null,"",{"$f":"MAX(0,$L$15-($AX$87))","v":0},{"$f":"MAX(0,$N$15-($AY$87))","v":0},{"$f":"MAX(0,$R$15-($AX$87))","v":0},{"$f":"MAX(0,$T$15-($AY$87))","v":0},{"$f":"MAX(0,$X$15-($AX$87))","v":0},{"$f":"MAX(0,$Z$15-($AY$87))","v":0},{"$error":"#N/A"},{"$error":"#N/A"},{"$error":"#N/A"},{"$error":"#N/A"},{"$error":"#N/A"},{"$error":"#N/A"}]
[{"$nulls":38},38,76,55,110,null,null,"Butler",null,0,null,"",{"$f":"MAX(0,$L$15-($AX$87))","v":0},{"$f":"MAX(0,$N$15-($AY$87))","v":0},{"$f":"MAX(0,$R$15-($AX$87))","v":0},{"$f":"MAX(0,$T$15-($AY$87))","v":0},{"$f":"MAX(0,$X$15-($AX$87))","v":0},{"$f":"MAX(0,$Z$15-($AY$87))","v":0},{"$error":"#N/A"},{"$error":"#N/A"},{"$error":"#N/A"},{"$error":"#N/A"},{"$error":"#N/A"},{"$error":"#N/A"}]
[{"$nulls":38},39,78,56,112,null,null,"Carroll",null,"","Nutrient Credits",null,{"$f":"$L$26","v":0},{"$f":"$N$26","v":0},{"$nulls":4},{"$error":"#N/A"},{"$error":"#N/A"},{"$error":"#N/A"},{"$error":"#N/A"},{"$error":"#N/A"},{"$error":"#N/A"}]
[{"$nulls":38},39,78,57,114,null,null,"Champaign",null,0,null,{"$f":"IFERROR(INDEX(CommonFert,MATCH(AU91,FertList,0),6),\"\")","v":""},{"$f":"MAX(0,$L$16-($AX$90))","v":0},{"$f":"MAX(0,$N$16-($AY$90))","v":0},{"$f":"MAX(0,$R$16-($AX$90))","v":0},{"$f":"MAX(0,$T$16-($AY$90))","v":0},{"$f":"MAX(0,$X$16-($AX$90))","v":0},{"$f":"MAX(0,$Z$16-($AY$90))","v":0},{"$error":"#N/A"},{"$error":"#N/A"},{"$error":"#N/A"},{"$error":"#N/A"},{"$error":"#N/A"},{"$error":"#N/A"}]
[{"$nulls":38},40,80,58,116,null,null,"Clark",null,0,null,{"$f":"IFERROR(INDEX(CommonFert,MATCH(AU92,FertList,0),6),\"\")","v":""},{"$f":"MAX(0,$L$16-($AX$90))","v":0},{"$f":"MAX(0,$N$16-($AY$90))","v":0},{"$f":"MAX(0,$R$16-($AX$90))","v":0},{"$f":"MAX(0,$T$16-($AY$90))","v":0},{"$f":"MAX(0,$X16-($AX$90))","v":0},{"$f":"MAX(0,$Z$16-($AY$90))","v":0},{"$error":"#N/A"},{"$error":"#N/A"},{"$error":"#N/A"},{"$error":"#N/A"},{"$error":"#N/A"},{"$error":"#N/A"}]
[{"$nulls":38},41,82,59,118,null,null,"Clermont"]
[{"$nulls":38},42,84,60,120,null,null,"Clinton"]
[{"$nulls":38},43,86,61,122,null,null,"Columbiana"]
[{"$nulls":38},44,88,62,124,null,null,"Coshocton"]
[{"$nulls":38},44,88,63,126,null,null,"Crawford"]
[{"$nulls":38},45,90,64,128,null,null,"Cuyahoga"]
[{"$nulls":38},46,92,65,130,null,null,"Darke"]
[{"$nulls":38},47,94,66,132,null,null,"Defiance"]
[{"$nulls":38},48,96,67,134,null,null,"Delaware"]
[{"$nulls":38},48,96,68,136,null,null,"Erie"]
[{"$nulls":38},49,98,69,138,null,null,"Fairfield"]
[{"$nulls":38},50,100,70,140,null,null,"Fayette"]
[{"$nulls":38},51,102,71,142,null,null,"Franklin"]
[{"$nulls":38},52,104,72,144,null,null,"Fulton"]
[{"$nulls":38},53,106,73,146,null,null,"Gallia"]
[{"$nulls":38},53,106,74,148,null,null,"Geauga"]
[{"$nulls":38},54,108,75,150,null,null,"Greene"]
[{"$nulls":38},55,{"$f":"AM110*2","v":110},76,{"$f":"AO110*2","v":152},null,null,"Guernsey"]
[{"$nulls":38},56,112,77,154,null,null,"Hamilton"]
[{"$nulls":38},57,114,78,156,null,null,"Hancock"]
[{"$nulls":38},58,116,79,158,null,null,"Hardin"]
[{"$nulls":38},58,116,80,160,null,null,"Harrison"]
[{"$nulls":38},59,118,81,162,null,null,"Henry"]
[{"$nulls":38},60,120,82,164,null,null,"Highland"]
[{"$nulls":38},61,122,83,166,null,null,"Hocking"]
[{"$nulls":38},62,124,84,168,null,null,"Holmes"]
[{"$nulls":38},63,126,85,170,null,null,"Huron"]
[{"$nulls":38},63,126,86,172,null,null,"Jackson"]
[{"$nulls":38},64,128,87,174,null,null,"Jefferson"]
[{"$nulls":38},65,130,88,176,null,null,"Knox"]
[{"$nulls":38},66,132,89,178,null,null,"Lake"]
[{"$nulls":38},67,134,90,180,null,null,"Lawrence"]
[{"$nulls":38},68,136,91,182,null,null,"Licking"]
[{"$nulls":38},68,136,92,184,null,null,"Logan"]
[{"$nulls":38},69,138,93,186,null,null,"Lorain"]
[{"$nulls":38},70,140,94,188,null,null,"Lucas"]
[{"$nulls":38},71,142,95,190,null,null,"Madison"]
[{"$nulls":38},72,144,96,192,null,null,"Mahoning"]
[{"$nulls":38},73,146,97,194,null,null,"Marion"]
[{"$nulls":38},73,146,98,196,null,null,"Medina"]
[{"$nulls":38},74,148,99,198,null,null,"Meigs"]
[{"$nulls":38},75,150,100,200,null,null,"Mercer"]
[{"$nulls":38},76,152,101,202,null,null,"Miami"]
[{"$nulls":38},77,154,102,204,null,null,"Monroe"]
[{"$nulls":38},78,156,103,206,null,null,"Montgomery"]
[{"$nulls":38},78,156,104,208,null,null,"Morgan"]
[{"$nulls":38},79,158,105,210,null,null,"Morrow"]
[{"$nulls":38},80,160,106,212,null,null,"Muskingum"]
[{"$nulls":38},81,162,107,214,null,null,"Noble"]
[{"$nulls":38},82,164,108,216,null,null,"Ottawa"]
[{"$nulls":38},83,166,109,218,null,null,"Paulding"]
[{"$nulls":38},83,166,110,220,null,null,"Perry"]
[{"$nulls":38},84,168,111,222,null,null,"Pickaway"]
[{"$nulls":38},85,170,112,224,null,null,"Pike"]
[{"$nulls":38},86,172,113,226,null,null,"Portage"]
[{"$nulls":38},87,174,114,228,null,null,"Preble"]
[{"$nulls":38},88,176,115,230,null,null,"Putnam"]
[{"$nulls":38},88,176,116,232,null,null,"Richland"]
[{"$nulls":38},89,178,117,234,null,null,"Ross"]
[{"$nulls":38},90,180,118,236,null,null,"Sandusky"]
[{"$nulls":38},91,182,119,238,null,null,"Scioto"]
[{"$nulls":38},92,184,120,240,null,null,"Seneca"]
[{"$nulls":38},93,186,121,242,null,null,"Shelby"]
[{"$nulls":38},93,186,122,244,null,null,"Stark"]
[{"$nulls":38},94,188,123,246,null,null,"Summit"]
[{"$nulls":38},95,190,124,248,null,null,"Trumbull"]
[{"$nulls":38},96,192,125,250,null,null,"Tuscarawas"]
[{"$nulls":38},97,194,126,252,null,null,"Union"]
[{"$nulls":38},98,196,127,254,null,null,"Van Wert"]
[{"$nulls":38},98,196,128,256,null,null,"Vinton"]
[{"$nulls":38},99,198,129,258,null,null,"Warren"]
[{"$nulls":38},100,200,130,260,null,null,"Washington"]
[{"$nulls":38},101,202,131,262,null,null,"Wayne"]
[{"$nulls":38},102,204,132,264,null,null,"Williams"]
[{"$nulls":38},103,206,133,266,null,null,"Wood"]
[{"$nulls":38},103,206,134,268,null,null,"Wyandot"]
[{"$nulls":38},104,208,135,270]
[{"$nulls":38},105,210,136,272]
[{"$nulls":38},106,212,137,274]
[{"$nulls":38},107,214,138,276]
[{"$nulls":38},108,216,139,278]
[{"$nulls":38},108,{"$f":"AM174*2","v":216},140,{"$f":"AO174*2","v":280}]
[{"$nulls":38},109,218,141,282]
[{"$nulls":38},110,220,142,284]
[{"$nulls":38},111,222,143,286]
[{"$nulls":38},112,224,144,288]
[{"$nulls":38},113,226,145,290]
[{"$nulls":38},113,226,146,292]
[{"$nulls":38},114,228,147,294]
[{"$nulls":38},115,230,148,296]
[{"$nulls":38},116,232,149,298]
[{"$nulls":38},117,234,150,300]
[{"$nulls":38},118,236,151,302]
[{"$nulls":38},118,236,152,304]
[{"$nulls":38},119,238,153,306]
[{"$nulls":38},120,240,154,308]
[{"$nulls":38},121,242,155,310]
[{"$nulls":38},122,244,156,312]
[{"$nulls":38},123,246,157,314]
[{"$nulls":38},123,246,158,316]
[{"$nulls":38},124,248,159,318]
[{"$nulls":38},125,250,160,320]
[{"$nulls":38},126,252,161,322]
[{"$nulls":38},127,254,162,324]
[{"$nulls":38},128,256,163,326]
[{"$nulls":38},128,256,164,328]
[{"$nulls":38},129,258,165,330]
[{"$nulls":38},130,260,166,332]
[{"$nulls":38},131,262,167,334]
[{"$nulls":38},132,264,168,336]
[{"$nulls":38},133,266,169,338]
[{"$nulls":38},133,266,170,340]
[{"$nulls":38},134,268,171,342]
[{"$nulls":38},135,270,172,344]
[{"$nulls":38},136,272,173,346]
[{"$nulls":38},137,274,174,348]
[{"$nulls":38},138,276,175,350]
[{"$nulls":38},138,276,176,352]
[{"$nulls":38},139,278,177,354]
[{"$nulls":38},140,280,178,356]
[{"$nulls":38},141,282,179,358]
[{"$nulls":38},142,284,180,360]
[{"$nulls":38},143,286,181,362]
[{"$nulls":38},143,286,182,364]
[{"$nulls":38},144,288,183,366]
[{"$nulls":38},145,290,184,368]
[{"$nulls":38},146,292,185,370]
[{"$nulls":38},147,294,186,372]
[{"$nulls":38},148,296,187,374]
[{"$nulls":38},148,296,188,376]
[{"$nulls":38},149,298,189,378]
[{"$nulls":38},150,300,190,380]
[{"$nulls":38},151,302,191,382]
[{"$nulls":38},152,304,192,384]
[{"$nulls":38},152,304,193,386]
[{"$nulls":38},153,306,194,388]
[{"$nulls":38},154,308,195,390]
[{"$nulls":38},155,310,196,392]
[{"$nulls":38},156,312,197,394]
[{"$nulls":38},157,314,198,396]
[{"$nulls":38},157,314,199,398]
[{"$nulls":38},158,316,200,400]
[{"$nulls":38},159,318,201,402]
[{"$nulls":38},160,320,202,404]
[{"$nulls":38},161,322,203,406]
[{"$nulls":38},162,{"$f":"AM238*2","v":324},204,{"$f":"AO238*2","v":408}]
[{"$nulls":38},162,324,205,410]
[{"$nulls":38},163,326,206,412]
[{"$nulls":38},164,328,207,414]
[{"$nulls":38},165,330,208,416]
[{"$nulls":38},166,332,209,418]
[{"$nulls":38},167,334,210,420]
[{"$nulls":38},167,334,211,422]
[{"$nulls":38},168,336,212,424]
[{"$nulls":38},169,338,213,426]
[{"$nulls":38},170,340,214,428]
[{"$nulls":38},171,342,215,430]
[{"$nulls":38},172,344,216,432]
[{"$nulls":38},172,344,217,434]
[{"$nulls":38},173,346,218,436]
[{"$nulls":38},174,348,219,438]
[{"$nulls":38},175,350,220,440]
[{"$nulls":38},176,352,221,442]
[{"$nulls":38},177,354,222,444]
[{"$nulls":38},177,354,223,446]
[{"$nulls":38},178,356,224,448]
[{"$nulls":38},179,358,225,450]
[{"$nulls":38},180,360,226,452]
[{"$nulls":38},181,362,227,454]
[{"$nulls":38},182,364,228,456]
[{"$nulls":38},182,364,229,458]
[{"$nulls":38},183,366,230,460]
[{"$nulls":38},184,368,231,462]
[{"$nulls":38},185,370,232,464]
[{"$nulls":38},186,372,233,466]
[{"$nulls":38},187,374,234,468]
[{"$nulls":38},187,374,235,470]
[{"$nulls":38},188,376,236,472]
[{"$nulls":38},189,378,237,474]
[{"$nulls":38},190,380,238,476]
[{"$nulls":38},191,382,239,478]
[{"$nulls":38},192,384,240,480]
[{"$nulls":38},192,384,241,482]
[{"$nulls":38},193,386,242,484]
[{"$nulls":38},194,388,243,486]
[{"$nulls":38},195,390,244,488]
[{"$nulls":38},196,392,245,490]
[{"$nulls":38},197,394,246,492]
[{"$nulls":38},197,394,247,494]
[{"$nulls":38},198,396,248,496]
[{"$nulls":38},199,398,249,498]
[{"$nulls":38},200,400,250,500]

{"sheet":"2020 Tri-State VNMP","index":5,"n_rows":91,"n_cols":71,"rows_kept":91,"merged":[[0,1,0,26],[0,37,0,41],[0,43,0,44],[0,46,0,51],[1,1,1,26],[1,46,1,49],[2,1,3,5],[2,6,3,14],[2,15,3,18],[2,19,3,26],[4,1,4,26],[5,1,6,5],[5,6,6,14],[5,15,6,17],[5,18,6,26],[5,43,6,44],[7,1,8,5],[7,6,8,8],[7,9,8,11],[7,12,8,14],[7,15,8,17],[7,18,8,19],[7,20,8,21],[7,22,8,26],[9,1,9,26],[10,1,10,5],[10,6,10,10],[10,11,10,13],[10,14,10,16],[10,17,10,22],[10,23,10,26],[11,1,11,11],[11,12,11,14],[11,15,11,17],[11,18,11,20],[11,21,11,26],[12,1,13,11],[12,12,13,14],[12,15,13,17],[12,18,13,20],[12,21,13,26],[14,17,14,18],[14,19,14,26],[15,1,16,5],[15,6,16,11],[15,12,16,17],[15,18,15,26],[16,18,16,20],[16,21,16,23],[16,24,16,26],[17,1,17,5],[17,6,17,11],[17,12,17,15],[17,16,17,17],[17,18,17,20],[17,21,17,23],[17,24,17,26],[18,1,18,5],[18,6,18,11],[18,12,18,15],[18,16,18,17],[18,18,18,20],[18,21,18,23],[18,24,18,26],[18,43,18,46],[19,1,19,5],[19,6,19,11],[19,12,19,15],[19,16,19,17],[19,18,19,20],[19,21,19,23],[19,24,19,26],[19,43,19,46],[20,1,20,5],[20,6,20,11],[20,12,20,15],[20,16,20,17],[20,18,20,20],[20,21,20,23],[20,24,20,26],[21,1,22,12],[21,13,21,17],[21,18,21,20],[21,21,21,23],[21,24,21,26],[21,43,21,44],[21,45,21,46],[22,13,22,17],[22,18,22,20],[22,21,22,23],[22,24,22,26],[22,43,22,44],[22,45,22,46],[23,1,24,2],[23,3,23,7],[23,8,23,18],[23,19,23,22],[23,23,23,26],[24,3,24,7],[24,8,24,9],[24,10,24,12],[24,13,24,14],[24,15,24,16],[24,17,24,18],[24,19,24,20],[24,21,24,22],[24,23,24,26],[25,1,25,2],[25,3,25,7],[25,8,25,9],[25,10,25,11],[25,13,25,14],[25,15,25,16],[25,17,25,18],[25,19,25,20],[25,21,25,22],[25,23,25,26],[26,1,26,2],[26,3,26,7],[26,8,26,9],[26,10,26,11],[26,13,26,14],[26,15,26,16],[26,17,26,18],[26,19,26,20],[26,21,26,22],[26,23,26,26],[27,1,27,2],[27,3,27,7],[27,8,27,9],[27,10,27,11],[27,13,27,14],[27,15,27,16],[27,17,27,18],[27,19,27,20],[27,21,27,22],[27,23,27,26],[28,1,28,2],[28,3,28,7],[28,8,28,9],[28,10,28,11],[28,13,28,14],[28,15,28,16],[28,17,28,18],[28,19,28,20],[28,21,28,22],[28,23,28,26],[29,1,29,2],[29,3,29,7],[29,8,29,9],[29,10,29,11],[29,13,29,14],[29,15,29,16],[29,17,29,18],[29,19,29,20],[29,21,29,22],[29,23,29,26],[30,1,30,2],[30,3,30,7],[30,8,30,9],[30,10,30,11],[30,13,30,14],[30,15,30,16],[30,17,30,18],[30,19,30,20],[30,21,30,22],[30,23,30,26],[31,1,31,2],[31,3,31,7],[31,8,31,9],[31,10,31,11],[31,13,31,14],[31,15,31,16],[31,17,31,18],[31,19,31,20],[31,21,31,22],[31,23,31,26],[32,1,32,2],[32,3,32,7],[32,8,32,9],[32,10,32,11],[32,13,32,14],[32,15,32,16],[32,17,32,18],[32,19,32,20],[32,21,32,22],[32,23,32,26],[32,37,32,42],[33,1,33,2],[33,3,33,7],[33,8,33,9],[33,10,33,11],[33,13,33,14],[33,15,33,16],[33,17,33,18],[33,19,33,20],[33,21,33,22],[33,23,33,26],[34,1,34,2],[34,3,34,7],[34,8,34,9],[34,10,34,11],[34,13,34,14],[34,15,34,16],[34,17,34,18],[34,19,34,20],[34,21,34,22],[34,23,34,26],[35,1,35,2],[35,3,35,7],[35,8,35,9],[35,10,35,11],[35,13,35,14],[35,15,35,16],[35,17,35,18],[35,19,35,20],[35,21,35,22],[35,23,35,26],[36,1,36,8],[36,9,36,26],[37,1,37,6],[37,7,37,8],[37,9,37,13],[37,14,37,16],[37,17,37,19],[37,20,37,22],[37,23,37,25],[38,1,38,2],[38,3,38,4],[38,5,38,6],[38,9,38,13],[38,14,38,16],[38,17,38,19],[38,20,38,22],[38,23,38,25],[39,1,39,2],[39,3,39,4],[39,5,39,6],[39,7,39,8],[39,9,39,13],[39,14,39,16],[39,17,39,19],[39,20,39,22],[39,23,39,25],[40,1,40,6],[40,7,40,8],[40,9,40,13],[40,14,40,16],[40,17,40,19],[40,20,40,22],[40,23,40,25],[41,1,41,2],[41,3,41,4],[41,5,41,6],[41,9,41,13],[41,14,41,16],[41,17,41,19],[41,20,41,22],[41,23,41,25],[42,1,42,2],[42,3,42,4],[42,5,42,6],[42,7,42,8],[42,9,42,13],[42,14,42,16],[42,17,42,19],[42,20,42,22],[42,23,42,25],[42,37,42,40],[43,1,43,5],[43,6,43,8],[43,9,43,13],[43,14,43,16],[43,17,43,19],[43,20,43,22],[43,23,43,25],[44,1,45,8],[44,9,44,13],[44,14,44,16],[44,17,44,19],[44,20,44,22],[44,23,44,25],[44,43,44,48],[45,9,45,13],[45,14,45,16],[45,17,45,19],[45,20,45,22],[45,23,45,25],[46,1,48,26],[50,1,85,1],[50,2,55,4],[50,5,55,7],[50,8,55,10],[50,11,55,13],[50,14,55,16],[50,17,55,19],[50,20,55,22],[50,23,55,25],[56,2,60,4],[56,5,60,7],[56,8,60,10],[56,11,60,13],[56,14,60,16],[56,17,60,19],[56,20,60,22],[56,23,60,25],[61,2,65,4],[61,5,65,7],[61,8,65,10],[61,11,65,13],[61,14,65,16],[61,17,65,19],[61,20,65,22],[61,23,65,25],[66,2,69,4],[66,5,69,7],[66,8,69,10],[66,11,69,13],[66,14,69,16],[66,17,69,19],[66,20,69,22],[66,23,69,25],[70,2,73,4],[70,5,73,7],[70,8,73,10],[70,11,73,13],[70,14,73,16],[70,17,73,19],[70,20,73,22],[70,23,73,25],[74,2,77,4],[74,5,77,7],[74,8,77,10],[74,11,77,13],[74,14,77,16],[74,17,77,19],[74,20,77,22],[74,23,77,25],[78,2,81,4],[78,5,81,7],[78,8,81,10],[78,11,81,13],[78,14,81,16],[78,17,81,19],[78,20,81,22],[78,23,81,25],[82,2,85,4],[82,5,85,7],[82,8,85,10],[82,11,85,13],[82,14,85,16],[82,17,85,19],[82,20,85,22],[82,23,85,25],[86,1,93,1],[86,2,89,4],[86,5,89,7],[86,8,89,10],[86,11,89,13],[86,14,89,16],[86,17,89,19],[86,20,89,22],[86,23,89,25],[90,2,93,4],[90,5,93,7],[90,8,93,10],[90,11,93,13],[90,14,93,16],[90,17,93,19],[90,20,93,22],[90,23,93,25]]}
[{"$nulls":37},"Nutrient Removal Reference Table",{"$nulls":5},"Soil Test Units",null,null,"Plant Available Nitrogen Chart",{"$nulls":7},"Fertilizers","Nutrient Density","Nutrient Concentration",null,null,"form","Application Amount",{"$nulls":3},"Density","N","P","K","N","P","K"]
[{"$nulls":37},"Crop","Unit","N","P","K",null,"lb/ac",null,null,"Application & Incorporation Plan",{"$nulls":3},"Organic N","Ammonia N",{"$nulls":3},"N","N","P2O5","K2O",{"$nulls":4},{"$f":"D26","v":"Potash - (0-0-60)"},{"$f":"IFERROR(INDEX($BC$3:$BH$17,MATCH($D26,$BC$3:$BC$17,0),2,1),\"\")","v":1},{"$f":"IFERROR(INDEX($BC$3:$BH$17,MATCH($D26,$BC$3:$BC$17,0),3,1),\"\")","v":0},{"$f":"IFERROR(INDEX($BC$3:$BH$17,MATCH($D26,$BC$3:$BC$17,0),4,1),\"\")","v":0},{"$f":"IFERROR(INDEX($BC$3:$BH$17,MATCH($D26,$BC$3:$BC$17,0),5,1),\"\")","v":0.6},{"$f":"(BN2*$K26)*INDEX($BC$3:$BD$17,MATCH($BL2,$BC$3:$BC$17,0),2)","v":0},0,525]
[null,"Name",{"$nulls":4},"Baggins",{"$nulls":8},"Phone",{"$nulls":21},"Alfalfa","Ton",null,12,49,null,"ppm",null,null,"Mar - Apr Application; < 3 Days to Incorp",{"$nulls":3},{"v":0.33,"d":"33%"},{"v":0.5,"d":"50%"},null,null,"APP - (10-34-0)",11.7,{"v":0.1,"d":"10%"},{"v":0.34,"d":"34%"},{"v":0,"d":"0%"},"gal.","Starter",null,null,{"$f":"D27","v":"APP - (10-34-0)"},{"$f":"IFERROR(INDEX($BC$3:$BH$17,MATCH($D27,$BC$3:$BC$17,0),2,1),\"\")","v":11.7},{"$f":"IFERROR(INDEX($BC$3:$BH$17,MATCH($D27,$BC$3:$BC$17,0),3,1),\"\")","v":0.1},{"$f":"IFERROR(INDEX($BC$3:$BH$17,MATCH($D27,$BC$3:$BC$17,0),4,1),\"\")","v":0.34},{"$f":"IFERROR(INDEX($BC$3:$BH$17,MATCH($D27,$BC$3:$BC$17,0),5,1),\"\")","v":0},11.7,39.78,0]
[{"$nulls":37},"Barley","Bu",null,0.25,0.2,{"$nulls":4},"Mar - Apr Application; > 3 Days to Incorp",{"$nulls":3},{"v":0.33,"d":"33%"},{"v":0.25,"d":"25%"},null,null,"Anhydrous Am - (82-0-0)",1,{"v":0.82,"d":"82%"},{"v":0,"d":"0%"},{"v":0,"d":"0%"},"lbs.","1 Year N",null,null,{"$f":"D28","v":"Liquid UAN - (28-0-0)"},{"$f":"IFERROR(INDEX($BC$3:$BH$17,MATCH($D28,$BC$3:$BC$17,0),2,1),\"\")","v":10.7},{"$f":"IFERROR(INDEX($BC$3:$BH$17,MATCH($D28,$BC$3:$BC$17,0),3,1),\"\")","v":0.28},{"$f":"IFERROR(INDEX($BC$3:$BH$17,MATCH($D28,$BC$3:$BC$17,0),4,1),\"\")","v":0},{"$f":"IFERROR(INDEX($BC$3:$BH$17,MATCH($D28,$BC$3:$BC$17,0),5,1),\"\")","v":0},59.92,0,0]
[null,"Field Information",{"$nulls":35},"Bluegrass pasture","Ton",null,7.33,50,{"$nulls":4},"Apr - June Application; < 1 Days to Incorp",{"$nulls":3},{"v":0.33,"d":"33%"},{"v":0.75,"d":"75%"},null,null,"DAP - (18-46-0)",1,{"v":0.18,"d":"18%"},{"v":0.46,"d":"46%"},{"v":0,"d":"0%"},"lbs.","1 Year P",null,null,"APP - (10-34-0)",11.7,0.1,0.34,0,11.7,39.78,0]
[null,"Field Name",{"$nulls":4},"Bag End",{"$nulls":8},"Field Location",null,null,"Bagshot Row",{"$nulls":18},"Bluegrass seeding","Ton",null,7.33,50,null,"Soil Test Phosphorus Test Method",null,null,"Apr - June Application; > 1 Days to Incorp",{"$nulls":3},{"v":0.33,"d":"33%"},{"v":0.25,"d":"25%"},null,null,"KMag -  (0-0-22-23)",1,{"v":0,"d":"0%"},{"v":0,"d":"0%"},{"v":0.22,"d":"22%"},"lbs.","2 Year P",null,null,"Liquid UAN - (28-0-0)",10.7,0.28,0,0,164.78,0,0]
[{"$nulls":37},"Canola","Bu",null,0.7,0.46,{"$nulls":4},"Jul - Aug Application; < 1 Days to Incorp",{"$nulls":3},{"v":0.15,"d":"15%"},{"v":0.75,"d":"75%"},null,null,"Liquid UAN - (28-0-0)",10.7,{"v":0.28,"d":"28%"},{"v":0,"d":"0%"},{"v":0,"d":"0%"},"gal.","3 Year P",null,null,"MAP - (11-52-0)",1,0.11,0.52,0,13.2,62.400000000000006,0]
[null,"FSA Farm #",{"$nulls":7},"FSA Tract #",{"$nulls":5},"Field Size",null,null,{"v":20,"d":"20.0"},null,"Ac",null,"Lucas",{"$nulls":14},"Corn","Bu",null,0.35,0.2,null,"Bray P1",null,null,"Jul - Aug Application; > 1 Days to Incorp",{"$nulls":3},{"v":0.15,"d":"15%"},{"v":0.25,"d":"25%"},null,null,"Liquid UAN - (32-0-0)",10.7,{"v":0.32,"d":"32%"},{"v":0,"d":"0%"},{"v":0,"d":"0%"},"gal.","1 Year K",null,null,"Potash - (0-0-60)",1,0,0,0.6,0,0,525]
[{"$nulls":37},"Corn silage","Ton",null,3.1,7.3,null,"Mehlich III",null,null,"Sep - Oct Application; < 1 Days to Incorp",{"$nulls":3},{"v":0.33,"d":"33%"},{"v":0.25,"d":"25%"},null,null,"MAP - (11-52-0)",1,{"v":0.11,"d":"11%"},{"v":0.52,"d":"52%"},{"v":0,"d":"0%"},"lbs.","2 Year K",null,null,"APP - (10-34-0)",11.7,0.1,0.34,0,11.7,39.78,0]
[null,"Soil Test Results",{"$nulls":31},"Yes",{"$nulls":3},"Grass pasture","Ton",null,12,49,{"$nulls":4},"Sep - Oct Application; > 1 Days to Incorp",{"$nulls":3},{"v":0.33,"d":"33%"},{"v":0.15,"d":"15%"},null,null,"Potash - (0-0-60)",1,{"v":0,"d":"0%"},{"v":0,"d":"0%"},{"v":0.6,"d":"60%"},"lbs.","3 Year K",null,null,{"v":0,"d":"0.00"},"","","","",{"$error":"#VALUE!"},{"$error":"#VALUE!"},{"$error":"#VALUE!"}]
[null,"Soil Test Date",{"$nulls":4},"2022-03-25",{"$nulls":4},"Soil Test Units",null,null,"ppm",null,null,"Soil Test Phosphorus Method",{"$nulls":5},"Mehlich III",{"$nulls":9},"No",{"$nulls":3},"Legume pasture","Ton",null,12,49,{"$nulls":12},"Sulfate of Potash - (0-0-50)",1,{"v":0,"d":"0%"},{"v":0,"d":"0%"},{"v":0.5,"d":"50%"},"lbs.",{"$nulls":3},{"v":0,"d":"0.00"},"","","","",{"$error":"#VALUE!"},{"$error":"#VALUE!"},{"$error":"#VALUE!"}]
[null,"Soil Test Lab",{"$nulls":10},"P",null,null,"K",null,null,"CEC",null,null,"Soil Test Comments",{"$nulls":15},"Legume-grass pasture","Ton",null,12,49,{"$nulls":12},"Urea - (46-0-0)",1,{"v":0.46,"d":"46%"},{"v":0,"d":"0%"},{"v":0,"d":"0%"},"lbs.",{"$nulls":3},{"v":0,"d":"0.00"},"","","","",{"$error":"#VALUE!"},{"$error":"#VALUE!"},{"$error":"#VALUE!"}]
[null,"Gamgee & Sons LLC",{"$nulls":10},34,null,null,25,null,null,22,null,null,"Field Average",{"$nulls":15},"Legume-tall grass","Ton",null,12,49,{"$nulls":12},"AMS - 21-0-0-24S",1,{"v":0.21,"d":"21%"},{"v":0,"d":"0%"},{"v":0,"d":"0%"},"lbs.",{"$nulls":3},{"$f":"D37","v":{"v":0,"d":"0.00"}},"","","","",{"$f":"(BN13*$K37)*INDEX($BC$3:$BD$17,MATCH($BL13,$BC$3:$BC$17,0),2)","v":{"$error":"#VALUE!"}},{"$f":"(BO13*$K37)*INDEX($BC$3:$BD$17,MATCH($BL13,$BC$3:$BC$17,0),2)","v":{"$error":"#VALUE!"}},{"$f":"(BP13*$K37)*INDEX($BC$3:$BD$17,MATCH($BL13,$BC$3:$BC$17,0),2)","v":{"$error":"#VALUE!"}}]
[{"$nulls":37},"Legume-tall grass seeding","Ton",null,12,49,null,"Manure Type",{"$nulls":10},"Liquid AMS - 8-0-0-9S",10.13,{"v":0.08,"d":"8%"},{"v":0,"d":"0%"},{"v":0,"d":"0%"},"gal.",{"$nulls":3},{"v":0,"d":"0.00"},"","","","",{"$error":"#VALUE!"},{"$error":"#VALUE!"},{"$error":"#VALUE!"}]
[null,"Crop Rotation, Yield, & Removal/Recommendation",{"$nulls":17},"Build for Wheat & Alfalfa",{"$nulls":17},"Oats","Bu",null,0.25,0.19,null,"Solid","lb/ton","ton","ton/ac",{"$nulls":7},"MESZ® - 12-40-0",1,{"v":0.12,"d":"12%"},{"v":0.4,"d":"40%"},{"v":0,"d":"0%"},"lbs."]
[null,"Year",{"$nulls":4},"Crop",{"$nulls":5},"Average Yield",{"$nulls":5},"Removal / Recommendation",{"$nulls":18},"Rye","Bu",null,0.64,0.36,null,"Liquid","lb/1000 Gal","gal","gal/ac",{"$nulls":7},{"$f":"IF(ISBLANK(B38),\" \",B38)","v":" "},{"$f":"IF(BH16=\"gal.\", 11, 1)","v":1},{"$f":"IF($BH16=\"tons\",B$40,(B$40*0.01))","v":{"v":0,"d":"0%"}},{"$f":"IF($BH16=\"tons\",D$40,(D$40*0.01))","v":{"v":0,"d":"0%"}},{"$f":"IF($BH16=\"tons\",F$40,(F$40*0.01))","v":{"v":0,"d":"0%"}},{"$f":"IF(H38=\"lbs.\",\"lbs.\",IF(H38=\"gal.\",\"gal.\",IF(H38=\"lbs/ton\",\"tons\",\"\")))","v":""}]
[{"$nulls":18},"N*",null,null,"P2O5",null,null,"K2O",{"$nulls":12},"Small grain forage","Ton",null,12,49,{"$nulls":12},{"$f":"IF(ISBLANK(B41),\" \",B41)","v":" "},{"$f":"IF(BH17=\"gal.\", 11, 1)","v":1},{"$f":"IF($BH17=\"tons\",B$43,(B$43*0.01))","v":{"v":0,"d":"0%"}},{"$f":"IF($BH17=\"tons\",D$43,(D$43*0.01))","v":{"v":0,"d":"0%"}},{"$f":"IF($BH17=\"tons\",F$43,(F$43*0.01))","v":{"v":0,"d":"0%"}},{"$f":"IF(H41=\"lbs.\",\"lbs.\",IF(H41=\"gal.\",\"gal.\",IF(H41=\"lbs/ton\",\"tons\",\"\")))","v":""}]
[null,2022,{"$nulls":4},"Soybean",{"$nulls":5},50,{"$nulls":3},{"$f":"IFERROR(VLOOKUP(G18,$AR$28:$AS$42,2,FALSE),\"\")","v":"Bu"},null,{"$f":"IFERROR(MAX(INDEX($AL$36:$AQ$36,MATCH(G18,AL$36:$AL$36,0),6),0),0)","v":0},null,null,{"$f":"IFERROR(IF($M$13>0,(INDEX($AR$27:$BI$42,MATCH(G18,$AR$27:$AR$42,0),MATCH($AN36,$AR$27:$BI$27,0))),0),0)","v":40},null,null,{"$f":"IF($P$13>0,IFERROR(IF(INDEX($AR$27:$BI$42,MATCH(G18,$AR$27:$AR$42,0),MATCH($AO36,$AR$27:$BI$27,0))>300, 300,(INDEX($AR$27:$BI$42,MATCH(G18,$AR$27:$AR$42,0),MATCH($AO36,$AR$27:$BI$27,0)))),0),0)","v":277},{"$nulls":12},"Sorghum","Bu",null,0.22,0.22]
[null,{"$f":"IF(B18>2018,B18+1,\" \")","v":2023},{"$nulls":4},"Wheat",{"$nulls":5},60,{"$nulls":3},{"$f":"IFERROR(VLOOKUP(G19,$AR$28:$AS$42,2,FALSE),\"\")","v":"Bu"},null,{"$f":"IFERROR(MAX(INDEX($AL$37:$AQ$37,MATCH(G19,AL$37:$AL$37,0),6),0),0)","v":{"v":57.5,"d":"58"}},null,null,{"$f":"IFERROR(IF($M$13>0,(INDEX($AR$27:$BI$42,MATCH(G19,$AR$27:$AR$42,0),MATCH($AN37,$AR$27:$BI$27,0))),0),0)","v":30},null,null,{"$f":"IF($P$13>0,IFERROR(IF(INDEX($AR$27:$BI$42,MATCH(G19,$AR$27:$AR$42,0),MATCH($AO37,$AR$27:$BI$27,0))>300, 300,(INDEX($AR$27:$BI$42,MATCH(G19,$AR$27:$AR$42,0),MATCH($AO37,$AR$27:$BI$27,0)))),0),0)","v":{"v":234.5,"d":"235"}},{"$nulls":12},"Sorghum-sudan forage","Ton",null,4.6,18,null,"Manure App Rate Multiplier"]
[null,{"$f":"IFERROR(IF(B19>2018,B19+1,\"\"),\"\")","v":2024},{"$nulls":4},"Corn",{"$nulls":5},180,{"$nulls":3},{"$f":"IFERROR(VLOOKUP(G20,$AR$28:$AS$42,2,FALSE),\"\")","v":"Bu"},null,{"$f":"IFERROR(MAX(INDEX($AL$38:$AQ$38,MATCH(G20,AL$38:$AL$38,0),6),0),0)","v":{"v":217.8,"d":"218"}},null,null,{"v":62.99999999999999,"d":"63"},null,null,{"$f":"IF($P$13>0,IFERROR(IF(INDEX($AR$27:$BI$42,MATCH(G20,$AR$27:$AR$42,0),MATCH($AO38,$AR$27:$BI$27,0))>300, 300,(INDEX($AR$27:$BI$42,MATCH(G20,$AR$27:$AR$42,0),MATCH($AO38,$AR$27:$BI$27,0)))),0),0)","v":{"v":255.5,"d":"256"}},{"$nulls":12},"Soybean","Bu",null,0.8,1.15,null,{"$f":"IF(Q38=\"Liquid\",1000,1)","v":1}]
[null,{"$f":"IFERROR(IF(B20>2018,B20+1,\"\"),\"\")","v":2025},{"$nulls":4},"Soybean",{"$nulls":5},50,{"$nulls":3},{"$f":"IFERROR(VLOOKUP(G21,$AR$28:$AS$42,2,FALSE),\"\")","v":"Bu"},null,{"$f":"IFERROR(MAX(INDEX($AL$39:$AQ$39,MATCH(G21,AL$39:$AL$39,0),6),0),0)","v":0},null,null,40,null,null,{"$f":"IF($P$13>0,IFERROR(IF(INDEX($AR$27:$BI$42,MATCH(G21,$AR$27:$AR$42,0),MATCH($AO39,$AR$27:$BI$27,0))>300, 300,(INDEX($AR$27:$BI$42,MATCH(G21,$AR$27:$AR$42,0),MATCH($AO39,$AR$27:$BI$27,0)))),0),0)","v":277},{"$nulls":12},"Spelt","Bu",null,0.63,0.37,null,"RoundDown Rate decimal Factor"]
[null,"Nutrient Application Plan",{"$nulls":11},"Nutrient Needs",{"$nulls":4},{"$f":"SUM(S18:U21)","v":{"v":275.3,"d":"275"}},null,null,{"$f":"SUM(V18:X21)","v":173},null,null,{"$f":"SUM(Y18:AA21)","v":1044},{"$nulls":12},"Sugar beet","Ton",null,1.3,3.3,null,"Rate",null,"Field Total"]
[{"$nulls":13},"Nutrient Planned",{"$nulls":4},{"$f":"SUM(N26:O36)","v":273},null,null,{"$f":"SUM(P26:Q36)","v":{"v":181.74,"d":"182"}},null,null,{"$f":"SUM(R26:S36)","v":1050},{"$nulls":12},"Tomato ","Ton",null,2.18,7,null,{"$f":"IF(Q38=\"Liquid\",-2,1)","v":1},null,{"$f":"IF(Q38=\"Liquid\",-2,0)","v":0}]
[null,"Target Crop",null,"Source",{"$nulls":4},"Rate - Pounds Recommended per Ac.",{"$nulls":10},"Time",{"$nulls":3},"Place",{"$nulls":13},"Wheat","Bu",null,0.5,0.25]
[{"$nulls":3},"Form",{"$nulls":4},"Rate",null,"Amount",null,null,"N*",null,"P2O5",null,"K2O",null,"Season",null,"Year",null,"Application Method",{"$nulls":13},"Wheat w/Stover","Bu",null,0.59,1.16]
[null,"Soybean",null,"Potash - (0-0-60)",{"$nulls":4},"2 Year K",null,875,null,{"$f":"IFERROR(INDEX(VFertList,MATCH(D26,$BC$2:$BC$17,0),6),\"\")","v":"lbs."},{"$f":"IFERROR(BQ2, \"0\")","v":0},null,{"$f":"IFERROR(BR2, \"0\")","v":0},null,{"$f":"IFERROR(BS2, \"0\")","v":525},null,"Spring",null,2022,null,"Broadcast W/ Incorp",{"$nulls":19},1,2,3,4,5,6,7,8,9,10,11,12,13,14,15,16,17,18,19]
[null,"Soybean",null,"APP - (10-34-0)",{"$nulls":4},"1 Year P",null,10,null,"gal.",{"$f":"IFERROR(BQ3, \"0\")","v":{"v":11.7,"d":"12"}},null,{"$f":"IFERROR(BR3, \"0\")","v":{"v":39.78,"d":"40"}},null,{"$f":"IFERROR(BS3, \"0\")","v":0},null,"Spring",null,2022,null,"Starter",{"$nulls":20},"Unit","YP","P","K","P Buildup","P Maintenance","No Apply","K Buildup","K Maintenance","P Critical Level","P Maintenance Top Level","K CL","K ML","K Divisor","N Credit","NRemoval","NRx","Max N"]
[null,"Wheat",null,"Liquid UAN - (28-0-0)",{"$nulls":4},"1 Year N",null,20,null,"gal.",{"v":59.92,"d":"60"},null,0,null,0,null,"Spring",null,2023,null,"Sidedress (Inject)",{"$nulls":19},"Alfalfa","Ton",{"$f":"INDEX(YP,MATCH($AR28,$AL$36:$AL$39,0),2)","v":{"$error":"#N/A"}},12,49,{"$f":"((($BB28-$AN$35)*5)+(AX28))","v":{"$error":"#N/A"}},{"$f":"AT28*AU28","v":{"$error":"#N/A"}},0,{"$f":"(($BD28-$AO$35)*((1+(0.05*$AP$35)))+(AT28*AV28)+20)","v":{"$error":"#N/A"}},{"$f":"((AT28*AV28)+20)-(((AT28*AV28)+20)*($AO$35-BD28)/BF28)","v":{"$error":"#N/A"}},{"$f":"IF($R$15=\"Yes\",30,30)","v":30},50,{"$f":"IF($S$13<5.1,100,120)","v":120},{"$f":"IF(BD28=120,BD28+50,BD28+30)","v":170},50,140,40,null,{"$f":"MIN((BH28*AT28),150)","v":{"$error":"#N/A"}}]
[null,"Wheat",null,"APP - (10-34-0)",{"$nulls":4},"1 Year P",null,10,null,"gal.",{"v":11.7,"d":"12"},null,{"v":39.78,"d":"40"},null,0,null,"Spring",null,2023,null,"Sidedress (Inject)",{"$nulls":19},"Barley","Bu",{"$error":"#N/A"},0.25,0.2,{"$f":"((($BB29-$AN$35)*5)+(AX29))","v":{"$error":"#N/A"}},{"$f":"AT29*AU29","v":{"$error":"#N/A"}},0,{"$f":"(($BD29-$AO$35)*((1+(0.05*$AP$35)))+(AT29*AV29)+20)","v":{"$error":"#N/A"}},{"$f":"(AT29*AV29)+20","v":{"$error":"#N/A"}},{"$f":"IF($R$15=\"Yes\",30,30)","v":30},50,{"$f":"IF($S$13<5.1,100,120)","v":120},{"$f":"IF(BD29=120,BD29+50,BD29+30)","v":170},20,0,1,{"$f":"-27+(BH29*AT29)","v":{"$error":"#N/A"}},{"$f":"BI29","v":{"$error":"#N/A"}}]
[null,"Corn",null,"Liquid UAN - (28-0-0)",{"$nulls":4},"1 Year N",null,55,null,"gal.",{"v":164.78,"d":"165"},null,0,null,0,null,"Summer",null,2024,null,"Sidedress (Inject)",{"$nulls":19},"Corn","Bu",180,0.35,0.2,-7.000000000000007,{"$f":"AT30*AU30","v":62.99999999999999},0,255.5,{"$f":"(AT30*AV30)+20","v":56},{"$f":"IF($R$15=\"Yes\",30,20)","v":20},40,120,170,20,0,1.36,217.8,217.8]
[null,"Corn",null,"MAP - (11-52-0)",{"$nulls":4},"1 Year P",null,120,null,"lbs.",{"v":13.2,"d":"13"},null,{"v":62.400000000000006,"d":"62"},null,0,null,"Spring",null,2024,null,"Starter",{"$nulls":19},"Corn silage","Ton",{"$error":"#N/A"},3.1,7.3,{"$error":"#N/A"},{"$error":"#N/A"},0,{"$error":"#N/A"},{"$f":"((AT31*AV31)+20)-(((AT31*AV31)+20)*($AO$35-BD31)/BF31)","v":{"$error":"#N/A"}},{"$f":"IF($R$15=\"Yes\",30,20)","v":20},40,120,170,50,0,9.4,{"$error":"#N/A"},{"$error":"#N/A"}]
[null,"Corn",null,"Potash - (0-0-60)",{"$nulls":4},"2 Year K",null,875,null,"lbs.",0,null,0,null,525,null,"Spring",null,2024,null,"Broadcast W/ Incorp",{"$nulls":19},"Grass pasture","Ton",{"$error":"#N/A"},12,49,{"$error":"#N/A"},{"$error":"#N/A"},0,{"$error":"#N/A"},{"$f":"((AT32*AV32)+20)-(((AT32*AV32)+20)*($AO$35-BD32)/BF32)","v":{"$error":"#N/A"}},{"$f":"IF($R$15=\"Yes\",30,30)","v":30},50,120,170,50,40,40,{"$error":"#N/A"},{"$error":"#N/A"}]
[null,"Soybean",null,"APP - (10-34-0)",{"$nulls":4},"1 Year P",null,10,null,"gal.",{"v":11.7,"d":"12"},null,{"v":39.78,"d":"40"},null,0,null,"Spring",null,2025,null,"Starter",{"$nulls":13},"Recommendations",{"$nulls":5},"Legume pasture","Ton",{"$error":"#N/A"},12,49,{"$error":"#N/A"},{"$error":"#N/A"},0,{"$error":"#N/A"},{"$f":"((AT33*AV33)+20)-(((AT33*AV33)+20)*($AO$35-BD33)/BF33)","v":{"$error":"#N/A"}},{"$f":"IF($R$15=\"Yes\",30,30)","v":30},50,120,170,50,100,40,{"$error":"#N/A"},{"$error":"#N/A"}]
[{"$nulls":12},"","0",null,"0",null,"0",{"$nulls":21},"P","K","CEC","N Rec","Oats","Bu",{"$error":"#N/A"},0.25,0.19,{"$error":"#N/A"},{"$error":"#N/A"},0,{"$error":"#N/A"},{"$f":"(AT34*AV34)+20","v":{"$error":"#N/A"}},30,50,120,170,20,0,0.7,{"$error":"#N/A"},{"$error":"#N/A"}]
[{"$nulls":12},"","0",null,"0",null,"0",{"$nulls":21},{"$f":"IFERROR(IF(AND($X$11=\"Bray P1\",$O$11=\"ppm\"),ROUND(($M$13*1.35),0),IF(AND($X$11=\"Bray P1\",$O$11=\"lb/ac\"),ROUND((($M$13/2)*1.35),0),IF(AND($X$11=\"Mehlich III\",$O$11=\"ppm\"),$M$13,($M$13/2)))),0)","v":34},{"$f":"IF(O11=\"ppm\",P13,P13/2)","v":25},{"$f":"S13","v":22},null,"Rye","Bu",{"$error":"#N/A"},0.64,0.36,{"$error":"#N/A"},{"$error":"#N/A"},0,{"$error":"#N/A"},{"$f":"(AT35*AV35)+20","v":{"$error":"#N/A"}},30,50,120,170,20,0,1.3,{"$f":"40+(1.75*(AT35-50))","v":{"$error":"#N/A"}},{"$error":"#N/A"}]
[{"$nulls":12},"","0",null,"0",null,{"$f":"IFERROR(BS12, \"0\")","v":"0"},{"$nulls":19},{"$f":"G18","v":"Soybean"},{"$f":"M18","v":50},{"$f":"IF($AN$35<=VLOOKUP($AL36,Reference,11),\"P Buildup\",IF(AND($AN$35>=VLOOKUP($AL36,Reference,11),$AN$35<=VLOOKUP($AL36,Reference,12)),\"P Maintenance\",\"No Apply\"))","v":"P Maintenance"},{"$f":"IF($AO$35>VLOOKUP($AL36,Reference,14),\"No Apply\",IF($AO$35<=VLOOKUP($AL36,Reference,13),\"K Buildup\",\"K Maintenance\"))","v":"K Buildup"},{"$f":"IFERROR(IF(AND(AL35=\"Soybean\",OR($AL36=\"Wheat\",$AL36=\"Wheat w/ Stover\",$AL36=\"Rye\",$AL36=\"Spelt\")),0,INDEX($AR$28:$BK$42,MATCH($AL35,Crop,0),16)),0)","v":0},{"$f":"(INDEX($AR$28:$BI$42,MATCH(AL36,Crop,0),18))-AP36","v":0},"Sorghum","Bu",{"$error":"#N/A"},0.22,0.22,{"$error":"#N/A"},{"$error":"#N/A"},0,{"$error":"#N/A"},{"$f":"(AT36*AV36)+20","v":{"$error":"#N/A"}},{"$f":"IF($R$15=\"Yes\",30,30)","v":30},40,120,170,20,0,0.7,{"$f":"-27+(BH36*AT36)","v":{"$error":"#N/A"}},{"$error":"#N/A"}]
[null,"Custom Fertilizer",{"$nulls":7},"Product Summary",{"$nulls":21},{"$f":"INDEX($D$26:$D$36,MATCH(0,COUNTIF($J$38:$J38,$D$26:$D$36),0),1)","v":"Potash - (0-0-60)"},{"$f":"SUM(SUMIFS($K$26:$K$36,$D$26:$D$36,$AF37,$V$26:$V$36,$O$38, $T$26:$T$36, \"Spring\"),SUMIFS($K$26:$K$36,$D$26:$D$36,$AF37,$V$26:$V$36,$O$38, $T$26:$T$36, \"Summer\"),SUMIFS($K$26:$K$36,$D$26:$D$36,$AF37,$V$26:$V$36,($O$38-1), $T$26:$T$36, \"Fall\"))*$S$8","v":17500},{"$f":"SUM(SUMIFS($K$26:$K$36,$D$26:$D$36,$AF37,$V$26:$V$36,$R$38, $T$26:$T$36, \"Spring\"),SUMIFS($K$26:$K$36,$D$26:$D$36,$AF37,$V$26:$V$36,$R$38, $T$26:$T$36, \"Summer\"), SUMIFS($K$26:$K$36,$D$26:$D$36,$AF37,$V$26:$V$36,($R$38-1), $T$26:$T$36, \"Fall\"))*$S$8","v":0},{"$f":"SUM(SUMIFS($K$26:$K$36,$D$26:$D$36,$AF37,$V$26:$V$36,$U$38, $T$26:$T$36, \"Spring\"),SUMIFS($K$26:$K$36,$D$26:$D$36,$AF37,$V$26:$V$36,$U$38, $T$26:$T$36, \"Summer\"), SUMIFS($K$26:$K$36,$D$26:$D$36,$AF37,$V$26:$V$36,($U$38-1), $T$26:$T$36, \"Fall\"))*$S$8","v":17500},{"$f":"SUM(SUMIFS($K$26:$K$36,$D$26:$D$36,$AF37,$V$26:$V$36,$X$38, $T$26:$T$36, \"Spring\"),SUMIFS($K$26:$K$36,$D$26:$D$36,$AF37,$V$26:$V$36,$X$38, $T$26:$T$36, \"Summer\"), SUMIFS($K$26:$K$36,$D$26:$D$36,$AF37,$V$26:$V$36,($X$38-1), $T$26:$T$36, \"Fall\"))*$S$8","v":0},{"$f":"INDEX($BC$3:$BH$17,MATCH($J39,$BC$3:$BC$17,0),6)","v":"lbs."},{"$f":"G19","v":"Wheat"},{"$f":"M19","v":60},{"$f":"IF($AN$35<=VLOOKUP($AL37,Reference,11),\"P Buildup\",IF(AND($AN$35>=VLOOKUP($AL37,Reference,11),$AN$35<=VLOOKUP($AL37,Reference,12)),\"P Maintenance\",\"No Apply\"))","v":"P Maintenance"},{"$f":"IF($AO$35>VLOOKUP($AL37,Reference,14),\"No Apply\",IF($AO$35<=VLOOKUP($AL37,Reference,13),\"K Buildup\",\"K Maintenance\"))","v":"K Buildup"},{"$f":"IFERROR(IF(AND(AL36=\"Soybean\",OR($AL37=\"Wheat\",$AL37=\"Wheat w/ Stover\",$AL37=\"Rye\",$AL37=\"Spelt\")),0,INDEX($AR$28:$BK$42,MATCH($AL36,Crop,0),16)),0)","v":0},{"$f":"(INDEX($AR$28:$BI$42,MATCH(AL37,Crop,0),18))-AP37","v":{"v":57.5,"d":"58"}},"Sorghum-sudan forage","Ton",{"$f":"INDEX(YP,MATCH($AR37,$AL$36:$AL$39,0),2)","v":{"$error":"#N/A"}},4.6,18,{"$error":"#N/A"},{"$error":"#N/A"},0,{"$error":"#N/A"},{"$f":"((AT37*AV37)+20)-(((AT37*AV37)+20)*($AO$35-BD37)/BF37)","v":{"$error":"#N/A"}},{"$f":"IF($R$15=\"Yes\",30,30)","v":30},50,120,170,50,0,40,{"$f":"-27+(BH37*AT37)","v":{"$error":"#N/A"}},{"$error":"#N/A"}]
[{"$nulls":9},"Fertilizer ",{"$nulls":4},{"$f":"IFERROR(IF(B18>2018,B18,\"\"),\"\")","v":2022},null,null,{"$f":"B19","v":2023},null,null,{"$f":"B20","v":2024},null,null,{"$f":"B21","v":2025},null,null,"Unit",{"$nulls":4},{"$f":"INDEX($D$26:$D$36,MATCH(0,COUNTIF($J$38:$J39,$D$26:$D$36),0),1)","v":"APP - (10-34-0)"},{"$f":"SUM(SUMIFS($K$26:$K$36,$D$26:$D$36,$AF38,$V$26:$V$36,$O$38, $T$26:$T$36, \"Spring\"),SUMIFS($K$26:$K$36,$D$26:$D$36,$AF38,$V$26:$V$36,$O$38, $T$26:$T$36, \"Summer\"), SUMIFS($K$26:$K$36,$D$26:$D$36,$AF38,$V$26:$V$36,($O$38-1), $T$26:$T$36, \"Fall\"))*$S$8","v":200},200,0,200,{"$f":"INDEX($BC$3:$BH$17,MATCH($J40,$BC$3:$BC$17,0),6)","v":"gal."},{"$f":"G20","v":"Corn"},{"$f":"M20","v":180},{"$f":"IF($AN$35<=VLOOKUP($AL38,Reference,11),\"P Buildup\",IF(AND($AN$35>=VLOOKUP($AL38,Reference,11),$AN$35<=VLOOKUP($AL38,Reference,12)),\"P Maintenance\",\"No Apply\"))","v":"P Maintenance"},{"$f":"IF($AO$35>VLOOKUP($AL38,Reference,14),\"No Apply\",IF($AO$35<=VLOOKUP($AL38,Reference,13),\"K Buildup\",\"K Maintenance\"))","v":"K Buildup"},{"$f":"IFERROR(IF(AND(AL37=\"Soybean\",OR($AL38=\"Wheat\",$AL38=\"Wheat w/ Stover\",$AL38=\"Rye\",$AL38=\"Spelt\")),0,INDEX($AR$28:$BK$42,MATCH($AL37,Crop,0),16)),0)","v":0},{"$f":"(INDEX($AR$28:$BI$42,MATCH(AL38,Crop,0),18))-AP38","v":{"v":217.8,"d":"218"}},"Soybean","Bu",{"$f":"INDEX(YP,MATCH($AR38,$AL$36:$AL$39,0),2)","v":50},0.8,1.15,-30,40,0,277,{"$f":"((AT38*AV38)+20)","v":77.5},{"$f":"IF($R$15=\"Yes\",30,20)","v":20},40,120,170,20,30,3.8,null,{"$f":"MIN((BH38*AT38),150)","v":150}]
[null,"N",null,"P",null,"K",null,"Units",null,{"$f":"IFERROR($AF37,\"\")","v":"Potash - (0-0-60)"},{"$nulls":4},{"$f":"IFERROR(IF($AK37=\"tons\",(AG37),AG37),\"\")","v":{"v":17500,"d":"17,500"}},null,null,{"$f":"IFERROR(IF($AK37=\"tons\",(AH37),AH37),\"\")","v":0},null,null,{"$f":"IFERROR(IF($AK37=\"tons\",($AI37),$AI37),\"\")","v":{"v":17500,"d":"17,500"}},null,null,{"$f":"IFERROR(IF($AK37=\"tons\",(AJ37),AJ37),\"\")","v":0},null,null,{"$f":"IFERROR(AK37,\"\")","v":"lbs."},{"$nulls":4},{"$f":"INDEX($D$26:$D$36,MATCH(0,COUNTIF($J$38:$J40,$D$26:$D$36),0),1)","v":"Liquid UAN - (28-0-0)"},{"$f":"SUM(SUMIFS($K$26:$K$36,$D$26:$D$36,$AF39,$V$26:$V$36,$O$38, $T$26:$T$36, \"Spring\"),SUMIFS($K$26:$K$36,$D$26:$D$36,$AF39,$V$26:$V$36,$O$38, $T$26:$T$36, \"Summer\"), SUMIFS($K$26:$K$36,$D$26:$D$36,$AF39,$V$26:$V$36,($O$38-1), $T$26:$T$36, \"Fall\"))*$S$8","v":0},400,1100,0,"gal.",{"$f":"G21","v":"Soybean"},{"$f":"M21","v":50},{"$f":"IF($AN$35<=VLOOKUP($AL39,Reference,11),\"P Buildup\",IF(AND($AN$35>=VLOOKUP($AL39,Reference,11),$AN$35<=VLOOKUP($AL39,Reference,12)),\"P Maintenance\",\"No Apply\"))","v":"P Maintenance"},{"$f":"IF($AO$35>VLOOKUP($AL39,Reference,14),\"No Apply\",IF($AO$35<=VLOOKUP($AL39,Reference,13),\"K Buildup\",\"K Maintenance\"))","v":"K Buildup"},{"$f":"IFERROR(IF(AND(AL38=\"Soybean\",OR($AL39=\"Wheat\",$AL39=\"Wheat w/ Stover\",$AL39=\"Rye\",$AL39=\"Spelt\")),0,INDEX($AR$28:$BK$42,MATCH($AL38,Crop,0),16)),0)","v":0},{"$f":"(INDEX($AR$28:$BI$42,MATCH(AL39,Crop,0),18))-AP39","v":0},"Spelt","Bu",{"$f":"INDEX(YP,MATCH($AR39,$AL$36:$AL$39,0),2)","v":{"$error":"#N/A"}},0.63,0.37,{"$error":"#N/A"},{"$error":"#N/A"},0,{"$error":"#N/A"},{"$f":"((AT39*AV39)+20)","v":{"$error":"#N/A"}},30,50,120,170,20,0,1.3,{"$f":"-27+(BH39*AT39)","v":{"$error":"#N/A"}},{"$f":"BI39","v":{"$error":"#N/A"}}]
[{"$nulls":9},"APP - (10-34-0)",{"$nulls":4},{"$f":"IFERROR(IF($AK38=\"tons\",(AG38),AG38),\"\")","v":200},null,null,{"$f":"IFERROR(IF($AK38=\"tons\",(AH38),AH38),\"\")","v":200},null,null,{"$f":"IFERROR(IF($AK38=\"tons\",($AI38),$AI38),\"\")","v":0},null,null,{"$f":"IFERROR(IF($AK38=\"tons\",(AJ38),AJ38),\"\")","v":200},null,null,"gal.",{"$nulls":4},{"$f":"INDEX($D$26:$D$36,MATCH(0,COUNTIF($J$38:$J41,$D$26:$D$36),0),1)","v":"MAP - (11-52-0)"},0,0,2400,0,"lbs.",{"$nulls":4},"N Credit",null,"Tomato ","Ton",{"$f":"INDEX(YP,MATCH($AR40,$AL$36:$AL$39,0),2)","v":{"$error":"#N/A"}},2.18,7,{"$error":"#N/A"},{"$f":"AT40*AU40","v":{"$error":"#N/A"}},0,{"$error":"#N/A"},{"$f":"((AT40*AV40)+20)","v":{"$error":"#N/A"}},50,80,120,170,20,0,null,80]
[{"$nulls":9},"Liquid UAN - (28-0-0)",{"$nulls":4},0,null,null,400,null,null,{"v":1100,"d":"1,100"},null,null,0,null,null,"gal.",{"$nulls":4},{"$f":"INDEX($D$26:$D$36,MATCH(0,COUNTIF($J$38:$J42,$D$26:$D$36),0),1)","v":0},0,0,0,0,{"$error":"#N/A"},{"$nulls":6},"Wheat","Bu",{"$f":"INDEX(YP,MATCH($AR41,$AL$36:$AL$39,0),2)","v":60},0.5,0.25,10,{"$f":"AT41*AU41","v":30},0,234.5,{"$f":"(AT41*AV41)+20","v":35},{"$f":"IF($R$15=\"Yes\",30,30)","v":30},50,120,170,20,0,1.3,{"$f":"40+(1.75*(AT41-50))","v":57.5},{"$f":"BI41","v":57.5}]
[null,"N",null,"P",null,"K",null,"Units",null,{"$f":"IFERROR($AF40,\"\")","v":"MAP - (11-52-0)"},{"$nulls":4},0,null,null,0,null,null,{"v":2400,"d":"2,400"},null,null,0,null,null,"lbs.",{"$nulls":4},{"$f":"INDEX($D$26:$D$36,MATCH(0,COUNTIF($J$38:$J43,$D$26:$D$36),0),1)","v":{"$error":"#N/A"}},0,0,0,0,{"$error":"#N/A"},{"$nulls":6},{"$f":"AL25","v":"Wheat w/Stover"},"Bu",{"$f":"INDEX(YP,MATCH($AR42,$AL$36:$AL$39,0),2)","v":{"$error":"#N/A"}},0.59,1.16,{"$error":"#N/A"},{"$f":"AT42*AU42","v":{"$error":"#N/A"}},0,{"$error":"#N/A"},{"$f":"(AT42*AV42)+20","v":{"$error":"#N/A"}},{"$f":"IF($R$15=\"Yes\",30,30)","v":30},50,120,170,20,0,1.3,{"$f":"40+(1.75*(AT42-50))","v":{"$error":"#N/A"}},{"$f":"BI42","v":{"$error":"#N/A"}}]
[{"$nulls":9},{"$f":"IFERROR($AF41,\"\")","v":0},{"$nulls":4},"",null,null,"",null,null,"",null,null,"",null,null,"",{"$nulls":4},{"$f":"INDEX($D$26:$D$36,MATCH(0,COUNTIF($J$38:$J44,$D$26:$D$36),0),1)","v":{"$error":"#N/A"}},0,0,0,0,{"$error":"#N/A"}]
[null,"Plan Writer",{"$nulls":4},"Date",null,null,"",{"$nulls":4},"",null,null,"",null,null,"",null,null,"",null,null,"",{"$nulls":4},{"$f":"INDEX($D$26:$D$36,MATCH(0,COUNTIF($J$38:$J45,$D$26:$D$36),0),1)","v":{"$error":"#N/A"}},0,0,0,0,{"$error":"#N/A"}]
[{"$nulls":9},"",{"$nulls":4},"",null,null,"",null,null,"",null,null,"",null,null,"",{"$nulls":4},{"$f":"INDEX($D$26:$D$36,MATCH(0,COUNTIF($J$38:$J46,$D$26:$D$36),0),1)","v":{"$error":"#N/A"}},0,0,0,0,{"$error":"#N/A"}]
[{"$nulls":9},"",{"$nulls":4},"",null,null,"",null,null,"",null,null,"",null,null,"",{"$nulls":4},{"$f":"INDEX($D$26:$D$36,MATCH(0,COUNTIF($J$38:$J50,$D$26:$D$36),0),1)","v":{"$error":"#N/A"}},0,0,0,0,{"$error":"#N/A"}]
[null,"Notes"]
[]
[]
[]
[null,{"$f":"S8","v":{"v":20,"d":"20.0"}},"Was the ground frozen or snow covered? (For Surface Application Only)"]
[]
[]
[]
[]
[]
[null,null,"Weather forecast for next 12 & 24 Hours"]
[]
[]
[]
[]
[null,null,"Weather conditions, temp., precipitation at time of application"]
[]
[]
[]
[]
[null,null,"Application method"]
[]
[]
[]
[null,null,"Soil conditions at time of application"]
[]
[]
[]
[null,null,"Name of Certificate Holder"]
[]
[]
[]
[null,null,"Name of applicator"]
[]
[]
[]
[null,null,"Fertilizer analysis and total amount"]
[]
[]
[]
[null,"Application Record for:","Rate & acres of application"]
[]
[]
[]
[null,null,"Date of application"]

{"sheet":"2020 Tri-State VRT Review Tool","index":6,"n_rows":168,"n_cols":69,"rows_kept":168,"merged":[[0,0,1,2],[0,3,1,13],[0,14,1,16],[0,17,1,31],[0,38,0,42],[0,44,0,45],[0,47,0,52],[1,47,1,50],[2,0,2,31],[3,0,3,2],[3,3,3,13],[3,14,3,18],[3,19,3,31],[4,0,4,2],[4,3,4,6],[4,7,4,9],[4,10,4,13],[4,14,4,16],[4,17,4,18],[4,19,4,20],[4,21,4,23],[4,24,4,31],[5,0,5,31],[5,44,6,45],[6,0,6,3],[6,4,6,8],[6,9,6,12],[6,13,6,26],[6,27,7,31],[7,0,8,3],[7,4,8,8],[7,9,7,12],[7,13,7,14],[7,15,7,18],[7,19,7,20],[7,21,7,24],[7,25,7,26],[8,9,8,10],[8,11,8,12],[8,13,8,14],[8,15,8,16],[8,17,8,18],[8,19,8,20],[8,21,8,22],[8,23,8,24],[8,25,8,26],[8,27,8,31],[9,0,10,3],[9,4,10,8],[9,9,10,10],[9,11,10,12],[9,13,10,14],[9,15,10,16],[9,17,10,18],[9,19,10,20],[9,21,10,22],[9,23,10,24],[9,25,10,26],[9,27,11,31],[11,0,11,2],[11,3,11,5],[11,6,11,8],[11,9,11,10],[11,11,11,26],[12,0,12,2],[12,3,12,5],[12,6,12,7],[12,9,12,10],[12,11,12,12],[12,13,12,14],[12,17,12,18],[12,19,12,20],[12,21,15,22],[12,23,12,24],[12,25,12,26],[12,27,13,31],[13,0,13,2],[13,3,13,5],[13,6,13,7],[13,9,13,10],[13,11,13,12],[13,13,13,14],[13,17,13,18],[13,19,13,20],[13,23,13,24],[13,25,13,26],[14,0,14,2],[14,3,14,5],[14,6,14,7],[14,9,14,10],[14,11,14,12],[14,13,14,14],[14,17,14,18],[14,19,14,20],[14,23,14,24],[14,25,14,26],[14,27,15,31],[15,0,15,2],[15,3,15,5],[15,6,15,7],[15,9,15,10],[15,11,15,12],[15,13,15,14],[15,17,15,18],[15,19,15,20],[15,23,15,24],[15,25,15,26],[16,0,16,2],[16,3,16,10],[16,11,16,12],[16,13,16,14],[16,15,16,26],[16,27,16,31],[17,0,17,7],[17,8,17,10],[17,11,17,12],[17,13,17,14],[17,15,18,16],[17,17,17,18],[17,19,17,20],[17,23,17,24],[17,25,17,26],[17,27,17,31],[18,0,18,7],[18,8,18,10],[18,11,18,12],[18,13,18,14],[18,17,18,18],[18,19,18,20],[18,23,18,24],[18,25,18,26],[18,27,18,31],[18,44,18,47],[19,0,19,2],[19,3,19,10],[19,11,19,12],[19,13,19,14],[19,15,19,26],[19,27,19,31],[19,44,19,47],[20,0,20,7],[20,8,20,10],[20,11,20,12],[20,13,20,14],[20,17,20,18],[20,19,20,20],[20,21,21,22],[20,23,20,24],[20,25,20,26],[20,27,20,31],[21,0,21,7],[21,8,21,10],[21,11,21,12],[21,13,21,14],[21,17,21,18],[21,19,21,20],[21,23,21,24],[21,25,21,26],[21,27,21,31],[21,44,21,45],[21,46,21,47],[22,0,22,2],[22,3,22,10],[22,11,22,12],[22,13,22,14],[22,15,22,26],[22,27,22,31],[22,44,22,45],[22,46,22,47],[23,0,23,7],[23,8,23,10],[23,11,23,12],[23,13,23,14],[23,17,23,18],[23,19,23,20],[23,21,24,22],[23,23,23,24],[23,25,23,26],[23,27,23,31],[24,0,24,7],[24,8,24,10],[24,11,24,12],[24,13,24,14],[24,17,24,18],[24,19,24,20],[24,23,24,24],[24,25,24,26],[24,27,24,31],[25,0,25,2],[25,3,25,10],[25,11,25,12],[25,13,25,14],[25,15,25,26],[25,27,25,31],[26,0,26,7],[26,8,26,10],[26,11,26,12],[26,13,26,14],[26,17,26,18],[26,19,26,20],[26,21,27,22],[26,23,26,24],[26,25,26,26],[26,27,26,31],[27,0,27,7],[27,8,27,10],[27,11,27,12],[27,13,27,14],[27,17,27,18],[27,19,27,20],[27,23,27,24],[27,25,27,26],[27,27,27,31],[28,0,28,2],[28,3,28,5],[28,6,28,31],[29,0,29,2],[29,3,29,5],[29,6,29,31],[30,0,30,2],[30,3,30,5],[30,6,30,31],[31,0,31,2],[31,3,31,5],[31,6,31,31],[32,0,32,2],[32,3,32,5],[32,6,32,31],[32,44,32,49],[33,0,33,2],[33,3,33,5],[33,6,33,31],[34,0,34,31],[35,0,37,31],[38,0,38,12],[38,13,38,25],[38,26,38,31],[39,0,39,8],[39,9,39,12],[39,13,40,17],[39,18,40,25],[39,26,40,31],[40,0,40,2],[40,3,40,5],[40,6,40,8],[40,9,40,12],[41,0,41,2],[41,3,41,5],[41,6,41,8],[41,9,41,12],[41,13,42,17],[41,18,42,25],[41,26,42,31],[42,0,42,8],[42,9,42,12],[42,38,42,41],[43,0,43,2],[43,3,43,5],[43,6,43,8],[43,9,43,12],[43,13,44,17],[43,18,44,25],[43,26,44,31],[44,0,44,2],[44,3,44,5],[44,6,44,8],[44,9,44,12],[50,44,50,49],[68,44,68,49],[79,46,79,48],[80,47,80,48],[80,51,80,54],[80,57,80,60],[81,46,81,47],[82,46,82,47],[83,47,83,48],[83,51,83,54],[84,46,84,47],[85,46,85,47],[86,47,86,48],[86,51,86,54],[87,46,87,47],[88,46,88,47],[89,47,89,48],[89,51,89,54],[90,46,90,47],[91,46,91,47]]}
["Name",{"$nulls":13},"Phone",{"$nulls":23},"Nutrient Removal Reference Table",{"$nulls":5},"Soil Test Units",null,null,"Plant Available Nitrogen Chart",{"$nulls":7},2020,null,"Fertilizers","Nutrient Density","Nutrient Concentration",null,null,"form"]
[{"$nulls":38},"Crop","Unit","N","P","K",null,"lb/ac",null,null,"Application & Incorporation Plan",{"$nulls":3},"Organic N","Ammonia N",null,null,2021,null,null,"N","N","P2O5","K2O"]
["Field Information",{"$nulls":37},"Alfalfa","Ton",null,12,49,null,"ppm",null,null,"Mar - Apr Application; < 3 Days to Incorp",{"$nulls":3},{"v":0.33,"d":"33%"},{"v":0.5,"d":"50%"},null,null,2022,null,"APP - (10-34-0)",11.7,{"v":0.1,"d":"10%"},{"v":0.34,"d":"34%"},{"v":0,"d":"0%"},"gal."]
["Field Name",{"$nulls":13},"Field Location",{"$nulls":23},"Barley","Bu",null,0.25,0.2,{"$nulls":4},"Mar - Apr Application; > 3 Days to Incorp",{"$nulls":3},{"v":0.33,"d":"33%"},{"v":0.25,"d":"25%"},null,null,2023,null,"Anhydrous Am - (82-0-0)",1,{"v":0.82,"d":"82%"},{"v":0,"d":"0%"},{"v":0,"d":"0%"},"lbs."]
["FSA Farm #",{"$nulls":6},"FSA Tract #",{"$nulls":6},"Field Size",{"$nulls":4},"Ac.",null,"County",{"$nulls":16},"Bluegrass pasture","Ton",null,7.33,50,{"$nulls":4},"Apr - June Application; < 1 Days to Incorp",{"$nulls":3},{"v":0.33,"d":"33%"},{"v":0.75,"d":"75%"},null,null,2024,null,"DAP - (18-46-0)",1,{"v":0.18,"d":"18%"},{"v":0.46,"d":"46%"},{"v":0,"d":"0%"},"lbs."]
["Soil Test Results",{"$nulls":37},"Bluegrass seeding","Ton",null,7.33,50,null,"Soil Test Phosphorus Test Method",null,null,"Apr - June Application; > 1 Days to Incorp",{"$nulls":3},{"v":0.33,"d":"33%"},{"v":0.25,"d":"25%"},null,null,2025,null,"KMag -  (0-0-22-23)",1,{"v":0,"d":"0%"},{"v":0,"d":"0%"},{"v":0.22,"d":"22%"},"lbs."]
["Soil Test Date",{"$nulls":8},"Soil Test Lab",{"$nulls":17},"Build for Wheat & Alfalfa ",{"$nulls":10},"Canola","Bu",null,0.7,0.46,{"$nulls":4},"Jul - Aug Application; < 1 Days to Incorp",{"$nulls":3},{"v":0.15,"d":"15%"},{"v":0.75,"d":"75%"},null,null,2026,null,"Liquid UAN - (28-0-0)",10.7,{"v":0.28,"d":"28%"},{"v":0,"d":"0%"},{"v":0,"d":"0%"},"gal."]
["Soil Test Method",{"$nulls":8},"Soil Test #",{"$nulls":5},"Soil Test #",{"$nulls":5},"Soil Test  #",{"$nulls":16},"Corn","Bu",null,0.35,0.2,null,"Bray P1",null,null,"Jul - Aug Application; > 1 Days to Incorp",{"$nulls":3},{"v":0.15,"d":"15%"},{"v":0.25,"d":"25%"},null,null,2027,null,"Liquid UAN - (32-0-0)",10.7,{"v":0.32,"d":"32%"},{"v":0,"d":"0%"},{"v":0,"d":"0%"},"gal."]
[{"$nulls":9},"CEC",null,"P",null,"K",null,"CEC",null,"P",null,"K",null,"CEC",null,"P",null,"K",{"$nulls":12},"Corn silage","Ton",null,3.1,7.3,null,"Mehlich III",null,null,"Sep - Oct Application; < 1 Days to Incorp",{"$nulls":3},{"v":0.33,"d":"33%"},{"v":0.25,"d":"25%"},null,null,2028,null,"MAP - (11-52-0)",1,{"v":0.11,"d":"11%"},{"v":0.52,"d":"52%"},{"v":0,"d":"0%"},"lbs."]
["Soil Test Units",{"$nulls":26},"Seasonal Timing of Variable Rate Application",{"$nulls":10},"Grass pasture","Ton",null,12,49,{"$nulls":4},"Sep - Oct Application; > 1 Days to Incorp",{"$nulls":3},{"v":0.33,"d":"33%"},{"v":0.15,"d":"15%"},null,null,2029,null,"Potash - (0-0-60)",1,{"v":0,"d":"0%"},{"v":0,"d":"0%"},{"v":0.6,"d":"60%"},"lbs."]
[{"$nulls":38},"Legume pasture","Ton",null,12,49,{"$nulls":12},2030,null,"Sulfate of Potash - (0-0-50)",1,{"v":0,"d":"0%"},{"v":0,"d":"0%"},{"v":0.5,"d":"50%"},"lbs."]
["Year",null,null,"Crop",null,null,"Avg Yield",null,null,"N",null,"Tri-State Fertilizer Recommendation (lbs/ac.)",{"$nulls":26},"Legume-grass pasture","Ton",null,12,49,{"$nulls":12},2031,null,"Urea - (46-0-0)",1,{"v":0.46,"d":"46%"},{"v":0,"d":"0%"},{"v":0,"d":"0%"},"lbs."]
[{"$nulls":8},{"$f":"IFERROR(VLOOKUP($D13,$AY$27:$AZ$42,2,FALSE),\"\")","v":""},{"$f":"IFERROR(MAX(INDEX($AS$36:$AX$36,MATCH($D13,AS$36:$AS$36,0),6),0),0)","v":0},null,{"$f":"IF($L$10>0,IFERROR(INDEX($AY$27:$BP$42,MATCH(D13,$AY$27:$AY$42,0),MATCH($AU36,$AY$27:$BP$27,0)),0),0)","v":0},null,{"$f":"IF($N$10>0,IFERROR(IF(INDEX($AY$27:$BP$42,MATCH(D13,$AY$27:$AY$42,0),MATCH($AV36,$AY$27:$BP$27,0))>300, 300,(INDEX($AY$27:$BP$42,MATCH(D13,$AY$27:$AY$42,0),MATCH($AV36,$AY$27:$BP$27,0)))),0),0)","v":0},{"$nulls":3},{"$f":"IF($R$10>0,IFERROR(INDEX($AY$45:$BP$60,MATCH(D13,$AY$45:$AY$60,0),MATCH($AU54,$AY$45:$BP$45,0)),0),0)","v":0},null,{"$f":"IF($T$10>0,IFERROR(IF(INDEX($AY$45:$BP$60,MATCH(D13,$AY$45:$AY$60,0),MATCH($AV54,$AY$45:$BP$45,0))>300, 300,(INDEX($AY$45:$BP$60,MATCH(D13,$AY$45:$AY$60,0),MATCH($AV54,$AY$45:$BP$45,0)))),0),0)","v":0},{"$nulls":3},{"$f":"IF($X$10>0,IFERROR(INDEX($AY$63:$BP$78,MATCH(D13,$AY$63:$AY$78,0),MATCH($AU72,$AY$63:$BP$63,0)),0),0)","v":0},null,{"$f":"IF($Z$10>0,IFERROR(IF(INDEX($AY$63:$BP$78,MATCH(D13,$AY$63:$AY$78,0),MATCH($AV72,$AY$63:$BP$63,0))>300, 300,(INDEX($AY$63:$BP$78,MATCH(D13,$AY$63:$AY$78,0),MATCH($AV72,$AY$63:$BP$63,0)))),0),0)","v":0},{"$nulls":12},"Legume-tall grass","Ton",null,12,49,{"$nulls":14},"AMS - 21-0-0-24S",1,{"v":0.21,"d":"21%"},{"v":0,"d":"0%"},{"v":0,"d":"0%"},"lbs."]
[{"$f":"IF(A13>0,$A13+1,\"\")","v":""},{"$nulls":7},{"$f":"IFERROR(VLOOKUP($D14,$AY$27:$AZ$42,2,FALSE),\"\")","v":""},{"$f":"IFERROR(MAX(INDEX($AS$37:$AX$37,MATCH($D14,AS$37:$AS$37,0),6),0),0)","v":0},null,{"$f":"IF($L$10>0,IFERROR(INDEX($AY$27:$BP$42,MATCH(D14,$AY$27:$AY$42,0),MATCH($AU37,$AY$27:$BP$27,0)),0),0)","v":0},null,{"$f":"IF($N$10>0,IFERROR(IF(INDEX($AY$27:$BP$42,MATCH(D14,$AY$27:$AY$42,0),MATCH($AV37,$AY$27:$BP$27,0))>300, 300,(INDEX($AY$27:$BP$42,MATCH(D14,$AY$27:$AY$42,0),MATCH($AV37,$AY$27:$BP$27,0)))),0),0)","v":0},{"$nulls":3},{"$f":"IF($R$10>0,IFERROR(INDEX($AY$45:$BP$60,MATCH(D14,$AY$45:$AY$60,0),MATCH($AU55,$AY$45:$BP$45,0)),0),0)","v":0},null,{"$f":"IF($T$10>0,IFERROR(IF(INDEX($AY$45:$BP$60,MATCH(D14,$AY$45:$AY$60,0),MATCH($AV55,$AY$45:$BP$45,0))>300, 300,(INDEX($AY$45:$BP$60,MATCH(D14,$AY$45:$AY$60,0),MATCH($AV55,$AY$45:$BP$45,0)))),0),0)","v":0},{"$nulls":3},{"$f":"IF($X$10>0,IFERROR(INDEX($AY$63:$BP$78,MATCH(D14,$AY$63:$AY$78,0),MATCH($AU73,$AY$63:$BP$63,0)),0),0)","v":0},null,{"$f":"IF($Z$10>0,IFERROR(IF(INDEX($AY$63:$BP$78,MATCH(D14,$AY$63:$AY$78,0),MATCH($AV73,$AY$63:$BP$63,0))>300, 300,(INDEX($AY$63:$BP$78,MATCH(D14,$AY$63:$AY$78,0),MATCH($AV73,$AY$63:$BP$63,0)))),0),0)","v":0},{"$nulls":12},"Legume-tall grass seeding","Ton",null,12,49,null,"Manure Type",{"$nulls":12},"Liquid AMS - 8-0-0-9S",10.13,{"v":0.08,"d":"8%"},{"v":0,"d":"0%"},{"v":0,"d":"0%"},"gal."]
[{"$f":"IFERROR($A14+1, \"\")","v":""},{"$nulls":7},{"$f":"IFERROR(VLOOKUP($D15,$AY$27:$AZ$42,2,FALSE),\"\")","v":""},{"$f":"IFERROR(MAX(INDEX($AS$38:$AX$38,MATCH($D15,AS$38:$AS$38,0),6),0),0)","v":0},null,{"$f":"IF($L$10>0,IFERROR(INDEX($AY$27:$BP$42,MATCH(D15,$AY$27:$AY$42,0),MATCH($AU38,$AY$27:$BP$27,0)),0),0)","v":0},null,{"$f":"IF($N$10>0,IFERROR(IF(INDEX($AY$27:$BP$42,MATCH(D15,$AY$27:$AY$42,0),MATCH($AV38,$AY$27:$BP$27,0))>300, 300,(INDEX($AY$27:$BP$42,MATCH(D15,$AY$27:$AY$42,0),MATCH($AV38,$AY$27:$BP$27,0)))),0),0)","v":0},{"$nulls":3},{"$f":"IF($R$10>0,IFERROR(INDEX($AY$45:$BP$60,MATCH(D15,$AY$45:$AY$60,0),MATCH($AU56,$AY$45:$BP$45,0)),0),0)","v":0},null,{"$f":"IF($T$10>0,IFERROR(IF(INDEX($AY$45:$BP$60,MATCH(D15,$AY$45:$AY$60,0),MATCH($AV56,$AY$45:$BP$45,0))>300, 300,(INDEX($AY$45:$BP$60,MATCH(D15,$AY$45:$AY$60,0),MATCH($AV56,$AY$45:$BP$45,0)))),0),0)","v":0},{"$nulls":3},{"$f":"IF($X$10>0,IFERROR(INDEX($AY$63:$BP$78,MATCH(D15,$AY$63:$AY$78,0),MATCH($AU74,$AY$63:$BP$63,0)),0),0)","v":0},null,{"$f":"IF($Z$10>0,IFERROR(IF(INDEX($AY$63:$BP$78,MATCH(D15,$AY$63:$AY$78,0),MATCH($AV74,$AY$63:$BP$63,0))>300, 300,(INDEX($AY$63:$BP$78,MATCH(D15,$AY$63:$AY$78,0),MATCH($AV74,$AY$63:$BP$63,0)))),0),0)","v":0},null,"Application Method",{"$nulls":10},"Oats","Bu",null,0.25,0.19,null,"Solid","lb/ton","ton","ton/ac",{"$nulls":9},"MESZ® - 12-40-0",1,{"v":0.12,"d":"12%"},{"v":0.4,"d":"40%"},{"v":0,"d":"0%"},"lbs."]
[{"$f":"IFERROR($A15+1, \"\")","v":""},{"$nulls":7},{"$f":"IFERROR(VLOOKUP($D16,$AY$27:$AZ$42,2,FALSE),\"\")","v":""},{"$f":"IFERROR(MAX(INDEX($AS$39:$AX$39,MATCH($D16,AS$39:$AS$39,0),6),0),0)","v":0},null,{"$f":"IF($L$10>0,IFERROR(INDEX($AY$27:$BP$42,MATCH(D16,$AY$27:$AY$42,0),MATCH($AU39,$AY$27:$BP$27,0)),0),0)","v":0},null,{"$f":"IF($N$10>0,IFERROR(IF(INDEX($AY$27:$BP$42,MATCH(D16,$AY$27:$AY$42,0),MATCH($AV39,$AY$27:$BP$27,0))>300, 300,(INDEX($AY$27:$BP$42,MATCH(D16,$AY$27:$AY$42,0),MATCH($AV39,$AY$27:$BP$27,0)))),0),0)","v":0},{"$nulls":3},{"$f":"IF($R$10>0,IFERROR(INDEX($AY$45:$BP$60,MATCH(D16,$AY$45:$AY$60,0),MATCH($AU57,$AY$45:$BP$45,0)),0),0)","v":0},null,{"$f":"IF($T$10>0,IFERROR(IF(INDEX($AY$45:$BP$60,MATCH(D16,$AY$45:$AY$60,0),MATCH($AV57,$AY$45:$BP$45,0))>300, 300,(INDEX($AY$45:$BP$60,MATCH(D16,$AY$45:$AY$60,0),MATCH($AV57,$AY$45:$BP$45,0)))),0),0)","v":0},{"$nulls":3},{"$f":"IF($X$10>0,IFERROR(INDEX($AY$63:$BP$78,MATCH(D16,$AY$63:$AY$78,0),MATCH($AU75,$AY$63:$BP$63,0)),0),0)","v":0},null,{"$f":"IF($Z$10>0,IFERROR(IF(INDEX($AY$63:$BP$78,MATCH(D16,$AY$63:$AY$78,0),MATCH($AV75,$AY$63:$BP$63,0))>300, 300,(INDEX($AY$63:$BP$78,MATCH(D16,$AY$63:$AY$78,0),MATCH($AV75,$AY$63:$BP$63,0)))),0),0)","v":0},{"$nulls":12},"Rye","Bu",null,0.64,0.36,null,"Liquid","lb/1000 Gal","gal","gal/ac",{"$nulls":9},{"$f":"IF(ISBLANK(A40),\" \",A40)","v":" "},{"$f":"IF(BK16=\"gal.\", 11, 1)","v":1},{"$f":"IF($BK16=\"tons\",A42,(A42*0.01))","v":{"v":0,"d":"0%"}},{"$f":"IF($BK16=\"tons\",D42,(D42*0.01))","v":{"v":0,"d":"0%"}},{"$f":"IF($BK16=\"tons\",G42,(G42*0.01))","v":{"v":0,"d":"0%"}},{"$f":"IF(J42=\"lbs.\",\"lbs.\",IF(J42=\"gal.\",\"gal.\",IF(J42=\"lbs/ton\",\"tons\",\"\")))","v":""}]
[{"$f":"IF(A13>0,$A13,\"\")","v":""},null,null,"Nutrient Credits",{"$nulls":11},"Applied P205 or K20 ",{"$nulls":22},"Small grain forage","Ton",null,12,49,{"$nulls":14},{"$f":"IF(ISBLANK(A43),\" \",A43)","v":" "},{"$f":"IF(BK17=\"gal.\", 11, 1)","v":1},{"$f":"IF(BK17=\"tons\",A45,(A45*0.01))","v":{"v":0,"d":"0%"}},{"$f":"IF(BK17=\"tons\",D45,(D45*0.01))","v":{"v":0,"d":"0%"}},{"$f":"IF(BK17=\"tons\",G45,(G45*0.01))","v":{"v":0,"d":"0%"}},{"$f":"IF(J45=\"lbs.\",\"lbs.\",IF(J45=\"gal.\",\"gal.\",IF(J45=\"lbs/ton\",\"tons\",\"\")))","v":""}]
[{"$nulls":8},{"$f":"IFERROR(INDEX($BF$2:$BK$17,MATCH($A18,FertList,0),6),\"\")","v":""},null,null,{"$f":"IFERROR(BD82,\"\")","v":""},null,{"$f":"IFERROR(BE82,\"\")","v":""},{"$nulls":3},{"$f":"IFERROR(BF82,\"\")","v":""},null,{"$f":"IFERROR(BG82,\"\")","v":""},{"$nulls":3},{"$f":"IFERROR(BH82,\"\")","v":""},null,{"$f":"IFERROR(BI82,\"\")","v":""},{"$nulls":12},"Sorghum","Bu",null,0.22,0.22]
[{"$nulls":8},{"$f":"IFERROR(INDEX($BF$2:$BK$17,MATCH($A19,FertList,0),6),\"\")","v":""},null,null,{"$f":"IFERROR(BD83,\"\")","v":""},null,{"$f":"IFERROR(BE83,\"\")","v":""},{"$nulls":3},{"$f":"IFERROR(BF83,\"\")","v":""},null,{"$f":"IFERROR(BG83,\"\")","v":""},{"$nulls":3},{"$f":"IFERROR(BH83,\"\")","v":""},null,{"$f":"IFERROR(BI83,\"\")","v":""},{"$nulls":12},"Sorghum-sudan forage","Ton",null,4.6,18,null,"Manure App Rate Multiplier"]
[{"$f":"A14","v":""},null,null,"Nutrient Credits",{"$nulls":11},"Applied P205 or K20 ",{"$nulls":22},"Soybean","Bu",null,0.8,1.15,null,{"$f":"IF(P37=\"Liquid\",1000,1)","v":1}]
[{"$nulls":8},{"$f":"IFERROR(INDEX($BF$2:$BK$17,MATCH($A21,FertList,0),6),\"\")","v":""},null,null,{"$f":"IFERROR(BD85,\"\")","v":""},null,{"$f":"IFERROR(BE85,\"\")","v":""},{"$nulls":3},{"$f":"IFERROR(BF85,\"\")","v":""},null,{"$f":"IFERROR(BG85,\"\")","v":""},{"$nulls":3},{"$f":"IFERROR(BH85,\"\")","v":""},null,{"$f":"IFERROR(BI85,\"\")","v":""},{"$nulls":12},"Spelt","Bu",null,0.63,0.37,null,"RoundDown Rate decimal Factor"]
[{"$nulls":8},{"$f":"IFERROR(INDEX($BF$2:$BK$17,MATCH($A22,FertList,0),6),\"\")","v":""},null,null,{"$f":"IFERROR(BD86,\"\")","v":""},null,{"$f":"IFERROR(BE86,\"\")","v":""},{"$nulls":3},{"$f":"IFERROR(BF86,\"\")","v":""},null,{"$f":"IFERROR(BG86,\"\")","v":""},{"$nulls":3},{"$f":"IFERROR(BH86,\"\")","v":""},null,{"$f":"IFERROR(BI86,\"\")","v":""},{"$nulls":12},"Sugar beet","Ton",null,1.3,3.3,null,"Rate",null,"Field Total"]
[{"$f":"A15","v":""},null,null,"Nutrient Credits",{"$nulls":11},"Applied P205 or K20 ",{"$nulls":22},"Tomato ","Ton",null,2.18,7,null,{"$f":"IF(P37=\"Liquid\",-2,1)","v":1},null,{"$f":"IF(P37=\"Liquid\",-2,0)","v":0}]
[{"$nulls":8},{"$f":"IFERROR(INDEX($BF$2:$BK$17,MATCH($A24,FertList,0),6),\"\")","v":""},null,null,{"$f":"IFERROR(BD88,\"\")","v":""},null,{"$f":"IFERROR(BE88,\"\")","v":""},{"$nulls":3},{"$f":"IFERROR(BF88,\"\")","v":""},null,{"$f":"IFERROR(BG88,\"\")","v":""},{"$nulls":3},{"$f":"IFERROR(BH88,\"\")","v":""},null,{"$f":"IFERROR(BI88,\"\")","v":""},{"$nulls":12},"Wheat","Bu",null,0.5,0.25]
[{"$nulls":8},{"$f":"IFERROR(INDEX($BF$2:$BK$17,MATCH($A25,FertList,0),6),\"\")","v":""},null,null,{"$f":"IFERROR(BD89,\"\")","v":""},null,{"$f":"IFERROR(BE89,\"\")","v":""},{"$nulls":3},{"$f":"IFERROR(BF89,\"\")","v":""},null,{"$f":"IFERROR(BG89,\"\")","v":""},{"$nulls":3},{"$f":"IFERROR(BH89,\"\")","v":""},null,{"$f":"IFERROR(BI89,\"\")","v":""},{"$nulls":12},"Wheat w/Stover","Bu",null,0.59,1.16]
[{"$f":"A16","v":""},null,null,"Nutrient Credits",{"$nulls":11},"Applied P205 or K20 ",{"$nulls":34},1,2,3,4,5,6,7,8,9,10,11,12,13,14,15,16,17,18,19]
[{"$nulls":8},{"$f":"IFERROR(INDEX($BF$2:$BK$17,MATCH($A27,FertList,0),6),\"\")","v":""},null,null,{"$f":"IFERROR(BD91,\"\")","v":""},null,{"$f":"IFERROR(BE91,\"\")","v":""},{"$nulls":3},{"$f":"IFERROR(BF91,\"\")","v":""},null,{"$f":"IFERROR(BG91,\"\")","v":""},{"$nulls":3},{"$f":"IFERROR(BH91,\"\")","v":""},null,{"$f":"IFERROR(BI91,\"\")","v":""},{"$nulls":12},"App Method","Timing","Unit",{"$nulls":10},"Unit","YP","P","K","P Buildup","P Maintenance","No Apply","K Buildup","K Maintenance","P Critical Level","P Upper Level","K CL","K ML","K Divisor","N Credit","NRemoval","NRx","Max N"]
[{"$nulls":8},{"$f":"IFERROR(INDEX($BF$2:$BK$17,MATCH($A28,FertList,0),6),\"\")","v":""},null,null,{"$f":"IFERROR(BD92,\"\")","v":""},null,{"$f":"IFERROR(BE92,\"\")","v":""},{"$nulls":3},{"$f":"IFERROR(BF92,\"\")","v":""},null,{"$f":"IFERROR(BG92,\"\")","v":""},{"$nulls":3},{"$f":"IFERROR(BH92,\"\")","v":""},null,{"$f":"IFERROR(BI92,\"\")","v":""},{"$nulls":12},"Select","Select","Select",{"$nulls":9},"Alfalfa","Ton",{"$f":"INDEX($AS$36:$AT$39,MATCH($AY28,$AS$36:$AS$39,0),2)","v":{"$error":"#N/A"}},12,49,{"$f":"((($BI28-$AU$35)*5)+(BE28))","v":{"$error":"#N/A"}},{"$f":"BA28*BB28","v":{"$error":"#N/A"}},0,{"$f":"(($BK28-$AV$35)*((1+(0.05*$AW$35)))+(BA28*BC28)+20)","v":{"$error":"#N/A"}},{"$f":"((BA28*BC28)+20)-(((BA28*BC28)+20)*($AV$35-BK28)/BM28)","v":{"$error":"#N/A"}},30,{"$f":"BI28+20","v":50},{"$f":"IF($J$10<5.1,100,120)","v":100},{"$f":"IF(BK28=120,BK28+50,BK28+30)","v":130},50,140,40,null,{"$f":"MIN((BO28*BA28),150)","v":{"$error":"#N/A"}}]
["Yes",null,null,"No",null,null,"Checklist",{"$nulls":43},"Barley","Bu",{"$error":"#N/A"},0.25,0.2,{"$f":"((($BI29-$AU$35)*5)+(BE29))","v":{"$error":"#N/A"}},{"$f":"BA29*BB29","v":{"$error":"#N/A"}},0,{"$error":"#N/A"},{"$f":"(BA29*BC29)+20","v":{"$error":"#N/A"}},30,{"$f":"BI29+20","v":50},{"$f":"IF($J$10<5.1,100,120)","v":100},{"$f":"IF(BK29=120,BK29+50,BK29+30)","v":130},20,0,1,{"$f":"-27+(BO29*BA29)","v":{"$error":"#N/A"}},{"$f":"BP29","v":{"$error":"#N/A"}}]
[{"$nulls":6},"Soil tests are four years old or less",{"$nulls":31},"Foliar","Fall","gal.",{"$nulls":9},"Corn","Bu",{"$error":"#N/A"},0.35,0.2,{"$f":"((($BI30-$AU$35)*5)+(BE30))","v":{"$error":"#N/A"}},{"$f":"BA30*BB30","v":{"$error":"#N/A"}},0,{"$error":"#N/A"},{"$f":"(BA30*BC30)+20","v":{"$error":"#N/A"}},{"$f":"IF($AB$9=\"Yes\",30,20)","v":20},40,100,130,20,0,1.36,{"$error":"#N/A"},{"$error":"#N/A"}]
[{"$nulls":6},"VRT application recommendations have been verified for Tri-State?",{"$nulls":31},"Inject","Spring","lbs.",{"$nulls":9},"Corn silage","Ton",{"$error":"#N/A"},3.1,7.3,{"$error":"#N/A"},{"$error":"#N/A"},0,{"$error":"#N/A"},{"$f":"((BA31*BC31)+20)-(((BA31*BC31)+20)*($AV$35-BK31)/BM31)","v":{"$error":"#N/A"}},{"$f":"IF($AB$9=\"Yes\",30,20)","v":20},40,100,130,50,0,9.4,{"$error":"#N/A"},{"$error":"#N/A"}]
[{"$nulls":6},"Identification of all nutrients planned for application are documented?",{"$nulls":31},"Manure Spreader","Summer","lbs/ton",{"$nulls":9},"Grass pasture","Ton",{"$error":"#N/A"},12,49,{"$error":"#N/A"},{"$error":"#N/A"},0,{"$error":"#N/A"},{"$f":"((BA32*BC32)+20)-(((BA32*BC32)+20)*($AV$35-BK32)/BM32)","v":{"$error":"#N/A"}},30,50,100,130,50,40,40,{"$error":"#N/A"},{"$error":"#N/A"}]
[{"$nulls":6},"Starter/Pop-up fertilizer is accounted for?",{"$nulls":31},"Pop-Up",{"$nulls":5},"Recommendations",{"$nulls":5},"Legume pasture","Ton",{"$error":"#N/A"},12,49,{"$error":"#N/A"},{"$error":"#N/A"},0,{"$error":"#N/A"},{"$f":"((BA33*BC33)+20)-(((BA33*BC33)+20)*($AV$35-BK33)/BM33)","v":{"$error":"#N/A"}},30,50,100,130,50,100,40,{"$error":"#N/A"},{"$error":"#N/A"}]
[{"$nulls":6},"Method and seasonal timing of application is documented?",{"$nulls":31},"Subsurface Band",{"$nulls":7},"P","K","CEC","N Rec","Oats","Bu",{"$error":"#N/A"},0.25,0.19,{"$error":"#N/A"},{"$error":"#N/A"},0,{"$error":"#N/A"},{"$f":"(BA34*BC34)+20","v":{"$error":"#N/A"}},30,50,100,130,20,0,0.7,{"$error":"#N/A"},{"$error":"#N/A"}]
["If any of the above answers are No please document how you will meet the requirements of an VNMP",{"$nulls":37},"Sidedress (Inject)",{"$nulls":7},{"$f":"IFERROR(IF(AND($E$8=\"Bray P1\",$E$10=\"ppm\"),ROUND(($L$10*1.35),0),IF(AND($E$8=\"Bray P1\",$E$10=\"lb/ac\"),ROUND((($L$10/2)*1.35),0),IF(AND($E$8=\"Mehlich III\",$E$10=\"ppm\"),$L$10,($L$10/2)))),0)","v":0},{"$f":"IF($E$10=\"ppm\",$N$10,$N$10/2)","v":0},{"$f":"J10","v":{"v":0,"d":"0.0"}},null,"Rye","Bu",{"$error":"#N/A"},0.64,0.36,{"$error":"#N/A"},{"$error":"#N/A"},0,{"$error":"#N/A"},{"$f":"(BA35*BC35)+20","v":{"$error":"#N/A"}},30,50,100,130,20,0,1.3,{"$f":"40+(1.75*(BA35-50))","v":{"$error":"#N/A"}},{"$error":"#N/A"}]
[{"$nulls":38},"Broadcast W/ Incorp",{"$nulls":5},{"$f":"$D$13","v":0},{"$f":"$G$13","v":0},{"$f":"IF($AU$35<=VLOOKUP($AS36,$AY$27:$BQ$42,11),\"P Buildup\",IF(AND($AU$35>=VLOOKUP($AS36,$AY$27:$BQ$42,11),$AU$35<=VLOOKUP($AS36,$AY$27:$BQ$42,12)),\"P Maintenance\", \"No Apply\"))","v":{"$error":"#N/A"}},{"$f":"IF($AV$35>VLOOKUP($AS36,$AY$27:$BQ$42,14),\"No Apply\",IF($AV$35<=VLOOKUP($AS36,$AY$27:$BQ$42,13), \"K Buildup\", \"K Maintenance\"))","v":{"$error":"#N/A"}},{"$f":"IFERROR(IF(AND(AS35=\"Soybean\",OR($AS36=\"Wheat\",$AS36=\"Wheat w/ Stover\",$AS36=\"Rye\",$AS36=\"Spelt\")),0,INDEX($AY$28:$BR$42,MATCH($AS35,Crop,0),16)),0)","v":0},{"$f":"(INDEX($AY$28:$BP$42,MATCH(AS36,Crop,0),18))-AW36","v":{"$error":"#N/A"}},"Sorghum","Bu",{"$error":"#N/A"},0.22,0.22,{"$error":"#N/A"},{"$error":"#N/A"},0,{"$error":"#N/A"},{"$f":"(BA36*BC36)+20","v":{"$error":"#N/A"}},{"$f":"IF($AB$9=\"Yes\",30,20)","v":20},40,100,130,20,0,0.7,{"$f":"-27+(BO36*BA36)","v":{"$error":"#N/A"}},{"$error":"#N/A"}]
[{"$nulls":38},"Broadcast W/O Incorp",{"$nulls":5},{"$f":"$D$14","v":0},{"$f":"$G$14","v":0},{"$f":"IF($AU$35<=VLOOKUP($AS37,$AY$27:$BQ$42,11),\"P Buildup\",IF(AND($AU$35>=VLOOKUP($AS37,$AY$27:$BQ$42,11),$AU$35<=VLOOKUP($AS37,$AY$27:$BQ$42,12)),\"P Maintenance\", \"No Apply\"))","v":{"$error":"#N/A"}},{"$f":"IF($AV$35>VLOOKUP($AS37,$AY$27:$BQ$42,14),\"No Apply\",IF($AV$35<=VLOOKUP($AS37,$AY$27:$BQ$42,13), \"K Buildup\", \"K Maintenance\"))","v":{"$error":"#N/A"}},{"$f":"IFERROR(IF(AND(AS36=\"Soybean\",OR($AS37=\"Wheat\",$AS37=\"Wheat w/ Stover\",$AS37=\"Rye\",$AS37=\"Spelt\")),0,INDEX($AY$28:$BR$42,MATCH($AS36,Crop,0),16)),0)","v":0},{"$f":"(INDEX($AY$28:$BP$42,MATCH(AS37,Crop,0),18))-AW37","v":{"$error":"#N/A"}},"Sorghum-sudan forage","Ton",{"$error":"#N/A"},4.6,18,{"$error":"#N/A"},{"$error":"#N/A"},0,{"$error":"#N/A"},{"$f":"((BA37*BC37)+20)-(((BA37*BC37)+20)*($AV$35-BK37)/BM37)","v":{"$error":"#N/A"}},30,50,100,130,50,0,40,{"$f":"-27+(BO37*BA37)","v":{"$error":"#N/A"}},{"$error":"#N/A"}]
[{"$nulls":38},"Banding W/ Incorp",{"$nulls":5},{"$f":"$D$15","v":0},{"$f":"$G$15","v":0},{"$error":"#N/A"},{"$error":"#N/A"},{"$f":"IFERROR(IF(AND(AS37=\"Soybean\",OR($AS38=\"Wheat\",$AS38=\"Wheat w/ Stover\",$AS38=\"Rye\",$AS38=\"Spelt\")),0,INDEX($AY$28:$BR$42,MATCH($AS37,Crop,0),16)),0)","v":0},{"$f":"(INDEX($AY$28:$BP$42,MATCH(AS38,Crop,0),18))-AW38","v":{"$error":"#N/A"}},"Soybean","Bu",{"$f":"INDEX($AS$36:$AT$39,MATCH($AY38,$AS$36:$AS$39,0),2)","v":{"$error":"#N/A"}},0.8,1.15,{"$error":"#N/A"},{"$error":"#N/A"},0,{"$f":"((($BK38-$AV$35)*((1+(0.05*$AW$35)))+((BA38*BC38))+20))","v":{"$error":"#N/A"}},{"$f":"((BA38*BC38)+20)","v":{"$error":"#N/A"}},{"$f":"IF($AB$9=\"Yes\",30,20)","v":20},40,100,130,20,30,3.8,null,{"$f":"MIN((BO38*BA38),150)","v":{"$error":"#N/A"}}]
["Custom Fertilizer",{"$nulls":12},"Reviewed By",{"$nulls":12},"Date",{"$nulls":11},"Banding W/O Incorp",{"$nulls":5},{"$f":"$D$16","v":0},{"$f":"$G$16","v":0},{"$error":"#N/A"},{"$error":"#N/A"},{"$f":"IFERROR(IF(AND(AS38=\"Soybean\",OR($AS39=\"Wheat\",$AS39=\"Wheat w/ Stover\",$AS39=\"Rye\",$AS39=\"Spelt\")),0,INDEX($AY$28:$BR$42,MATCH($AS38,Crop,0),16)),0)","v":0},{"$f":"(INDEX($AY$28:$BP$42,MATCH(AS39,Crop,0),18))-AW39","v":{"$error":"#N/A"}},"Spelt","Bu",{"$error":"#N/A"},0.63,0.37,{"$error":"#N/A"},{"$error":"#N/A"},0,{"$f":"(($BK39-$AV$35)*((1+(0.05*$AW$35)))+(BA39*BC39)+20)","v":{"$error":"#N/A"}},{"$f":"((BA39*BC39)+20)","v":{"$error":"#N/A"}},30,50,100,130,20,0,1.3,{"$f":"-27+(BO39*BA39)","v":{"$error":"#N/A"}},{"$f":"BP39","v":{"$error":"#N/A"}}]
[{"$nulls":9},"Name",{"$nulls":3},"Plan Writer",{"$nulls":24},"On Growing Cover Crop",{"$nulls":9},"N Credit",null,"Tomato ","Ton",{"$error":"#N/A"},2.18,7,{"$error":"#N/A"},{"$f":"$BA$40*BB40","v":{"$error":"#N/A"}},0,{"$f":"(($BK40-$AV$35)*((1+(0.05*$AW$35)))+(BA40*BC40)+20)","v":{"$error":"#N/A"}},{"$f":"((BA40*BC40)+20)","v":{"$error":"#N/A"}},50,{"$f":"BI40+30","v":80},100,130,20,0,null,80]
["N",null,null,"P",null,null,"K",null,null,"Units",{"$nulls":28},"Starter",{"$nulls":11},"Wheat","Bu",{"$error":"#N/A"},0.5,0.25,{"$error":"#N/A"},{"$f":"BA41*BB41","v":{"$error":"#N/A"}},0,{"$f":"(($BK41-$AV$35)*((1+(0.05*$AW$35)))+(BA41*BC41)+20)","v":{"$error":"#N/A"}},{"$f":"(BA41*BC41)+20","v":{"$error":"#N/A"}},30,50,100,130,20,0,1.3,{"$f":"40+(1.75*(BA41-50))","v":{"$error":"#N/A"}},{"$f":"BP41","v":{"$error":"#N/A"}}]
[{"$nulls":13},"Checked By",{"$nulls":36},"Wheat w/Stover","Bu",{"$error":"#N/A"},0.59,1.16,{"$error":"#N/A"},{"$f":"BA42*BB42","v":{"$error":"#N/A"}},0,{"$f":"(($BK42-$AV$35)*((1+(0.05*$AW$35)))+(BA42*BC42)+20)","v":{"$error":"#N/A"}},{"$f":"(BA42*BC42)+20","v":{"$error":"#N/A"}},30,50,100,130,20,0,1.3,{"$f":"40+(1.75*(BA42-50))","v":{"$error":"#N/A"}},{"$f":"BP42","v":{"$error":"#N/A"}}]
[{"$nulls":9},"Name"]
["N",null,null,"P",null,null,"K",null,null,"Units",{"$nulls":3},"Approved By",{"$nulls":36},1,2,3,4,5,6,7,8,9,10,11,12,13,14,15,16,17,18,19]
[{"$nulls":51},"Unit","YP","P","K","P Buildup","P Maintenance","No Apply","K Buildup","K Maintenance","P Critical Level","P Upper Level","K CL","K ML","K Divisor","N Credit","NRemoval","NRx","Max N"]
[{"$nulls":50},"Alfalfa","Ton",{"$f":"INDEX($AS$54:$AT$57,MATCH($AY46,$AS$36:$AS$39,0),2)","v":{"$error":"#N/A"}},12,49,{"$f":"((($BI46-$AU$53)*5)+(BE46))","v":{"$error":"#N/A"}},{"$f":"BA46*BB46","v":{"$error":"#N/A"}},0,{"$f":"(($BK46-$AV$53)*((1+(0.05*$AW$53)))+(BA46*BC46)+20)","v":{"$error":"#N/A"}},{"$f":"((BA46*BC46)+20)-(((BA46*BC46)+20)*($AV$53-BK46)/BM46)","v":{"$error":"#N/A"}},30,{"$f":"BI46+20","v":50},{"$f":"IF($P$10<5.1,100,120)","v":100},{"$f":"IF(BK46=120,BK46+50,BK46+30)","v":130},50,140,40,null,{"$f":"MIN((BO46*BA46),150)","v":{"$error":"#N/A"}}]
[{"$nulls":50},"Barley","Bu",{"$f":"INDEX($AS$54:$AT$57,MATCH($AY47,$AS$36:$AS$39,0),2)","v":{"$error":"#N/A"}},0.25,0.2,{"$error":"#N/A"},{"$f":"BA47*BB47","v":{"$error":"#N/A"}},0,{"$error":"#N/A"},{"$f":"(BA47*BC47)+20","v":{"$error":"#N/A"}},30,{"$f":"BI47+20","v":50},{"$f":"IF($P$10<5.1,100,120)","v":100},{"$f":"IF(BK47=120,BK47+50,BK47+30)","v":130},20,0,1,{"$f":"-27+(BO47*BA47)","v":{"$error":"#N/A"}},{"$f":"BP47","v":{"$error":"#N/A"}}]
[{"$nulls":50},"Corn","Bu",{"$error":"#N/A"},0.35,0.2,{"$error":"#N/A"},{"$f":"BA48*BB48","v":{"$error":"#N/A"}},0,{"$error":"#N/A"},{"$f":"(BA48*BC48)+20","v":{"$error":"#N/A"}},{"$f":"IF($AB$9=\"Yes\",30,20)","v":20},40,100,130,20,0,1.36,{"$error":"#N/A"},{"$error":"#N/A"}]
[{"$nulls":50},"Corn silage","Ton",{"$error":"#N/A"},3.1,7.3,{"$error":"#N/A"},{"$error":"#N/A"},0,{"$error":"#N/A"},{"$f":"((BA49*BC49)+20)-(((BA49*BC49)+20)*($AV$35-BK49)/BM49)","v":{"$error":"#N/A"}},{"$f":"IF($AB$9=\"Yes\",30,20)","v":20},40,100,130,50,0,9.4,{"$error":"#N/A"},{"$error":"#N/A"}]
[{"$nulls":50},"Grass pasture","Ton",{"$error":"#N/A"},12,49,{"$error":"#N/A"},{"$error":"#N/A"},0,{"$error":"#N/A"},{"$f":"((BA50*BC50)+20)-(((BA50*BC50)+20)*($AV$35-BK50)/BM50)","v":{"$error":"#N/A"}},30,50,100,130,50,40,40,{"$error":"#N/A"},{"$error":"#N/A"}]
[{"$nulls":44},"Recommendations",{"$nulls":5},"Legume pasture","Ton",{"$error":"#N/A"},12,49,{"$error":"#N/A"},{"$error":"#N/A"},0,{"$error":"#N/A"},{"$f":"((BA51*BC51)+20)-(((BA51*BC51)+20)*($AV$35-BK51)/BM51)","v":{"$error":"#N/A"}},30,50,100,130,50,100,40,{"$error":"#N/A"},{"$error":"#N/A"}]
[{"$nulls":46},"P","K","CEC","N Rec","Oats","Bu",{"$error":"#N/A"},0.25,0.19,{"$error":"#N/A"},{"$error":"#N/A"},0,{"$error":"#N/A"},{"$f":"(BA52*BC52)+20","v":{"$error":"#N/A"}},30,50,100,130,20,0,0.7,{"$error":"#N/A"},{"$error":"#N/A"}]
[{"$nulls":46},{"$f":"IFERROR(IF(AND($E$8=\"Bray P1\",$E$10=\"ppm\"),ROUND(($R$10*1.35),0),IF(AND($E$8=\"Bray P1\",$E$10=\"lb/ac\"),ROUND((($R$10/2)*1.35),0),IF(AND($E$8=\"Mehlich III\",$E$10=\"ppm\"),$R$10,($R$10/2)))),0)","v":0},{"$f":"IF(E10=\"ppm\",T10,T10/2)","v":0},{"$f":"P10","v":{"v":0,"d":"0.0"}},null,"Rye","Bu",{"$error":"#N/A"},0.64,0.36,{"$error":"#N/A"},{"$error":"#N/A"},0,{"$error":"#N/A"},{"$f":"(BA53*BC53)+20","v":{"$error":"#N/A"}},30,50,100,130,20,0,1.3,{"$f":"40+(1.75*(BA53-50))","v":{"$error":"#N/A"}},{"$error":"#N/A"}]
[{"$nulls":44},{"$f":"$D$13","v":0},{"$f":"$G$13","v":0},{"$f":"IF($AU$53<=VLOOKUP($AS54,$AY$45:$BQ$60,11),\"P Buildup\",IF(AND($AU$53>=VLOOKUP($AS54,$AY$45:$BQ$60,11),$AU$53<=VLOOKUP($AS54,$AY$45:$BQ$60,12)),\"P Maintenance\", \"No Apply\"))","v":{"$error":"#N/A"}},{"$f":"IF($AV$53>VLOOKUP($AS54,$AY$45:$BQ$60,14),\"No Apply\",IF($AV$53<=VLOOKUP($AS54,$AY$45:$BQ$60,13), \"K Buildup\", \"K Maintenance\"))","v":{"$error":"#N/A"}},{"$f":"IFERROR(IF(AND(AS53=\"Soybean\",OR($AS54=\"Wheat\",$AS54=\"Wheat w/ Stover\",$AS54=\"Rye\",$AS54=\"Spelt\")),0,INDEX($AY$46:$BR$60,MATCH($AS53,Crop,0),16)),0)","v":0},{"$f":"(INDEX($AY$28:$BP$42,MATCH(AS54,Crop,0),18))-AW54","v":{"$error":"#N/A"}},"Sorghum","Bu",{"$error":"#N/A"},0.22,0.22,{"$error":"#N/A"},{"$error":"#N/A"},0,{"$error":"#N/A"},{"$f":"(BA54*BC54)+20","v":{"$error":"#N/A"}},{"$f":"IF($AB$9=\"Yes\",30,20)","v":20},40,100,130,20,0,0.7,{"$f":"-27+(BO54*BA54)","v":{"$error":"#N/A"}},{"$error":"#N/A"}]
[{"$nulls":44},{"$f":"$D$14","v":0},{"$f":"$G$14","v":0},{"$f":"IF($AU$53<=VLOOKUP($AS55,$AY$45:$BQ$60,11),\"P Buildup\",IF(AND($AU$53>=VLOOKUP($AS55,$AY$45:$BQ$60,11),$AU$53<=VLOOKUP($AS55,$AY$45:$BQ$60,12)),\"P Maintenance\", \"No Apply\"))","v":{"$error":"#N/A"}},{"$f":"IF($AV$53>VLOOKUP($AS55,$AY$45:$BQ$60,14),\"No Apply\",IF($AV$53<=VLOOKUP($AS55,$AY$45:$BQ$60,13), \"K Buildup\", \"K Maintenance\"))","v":{"$error":"#N/A"}},{"$f":"IFERROR(IF(AND(AS54=\"Soybean\",OR($AS55=\"Wheat\",$AS55=\"Wheat w/ Stover\",$AS55=\"Rye\",$AS55=\"Spelt\")),0,INDEX($AY$46:$BR$60,MATCH($AS54,Crop,0),16)),0)","v":0},{"$f":"(INDEX($AY$28:$BP$42,MATCH(AS55,Crop,0),18))-AW55","v":{"$error":"#N/A"}},"Sorghum-sudan forage","Ton",{"$error":"#N/A"},4.6,18,{"$error":"#N/A"},{"$error":"#N/A"},0,{"$error":"#N/A"},{"$f":"((BA55*BC55)+20)-(((BA55*BC55)+20)*($AV$35-BK55)/BM55)","v":{"$error":"#N/A"}},30,50,100,130,50,0,40,{"$f":"-27+(BO55*BA55)","v":{"$error":"#N/A"}},{"$error":"#N/A"}]
[{"$nulls":44},{"$f":"$D$15","v":0},{"$f":"$G$15","v":0},{"$error":"#N/A"},{"$error":"#N/A"},{"$f":"IFERROR(IF(AND(AS55=\"Soybean\",OR($AS56=\"Wheat\",$AS56=\"Wheat w/ Stover\",$AS56=\"Rye\",$AS56=\"Spelt\")),0,INDEX($AY$46:$BR$60,MATCH($AS55,Crop,0),16)),0)","v":0},{"$f":"(INDEX($AY$28:$BP$42,MATCH(AS56,Crop,0),18))-AW56","v":{"$error":"#N/A"}},"Soybean","Bu",{"$error":"#N/A"},0.8,1.15,{"$error":"#N/A"},{"$error":"#N/A"},0,{"$error":"#N/A"},{"$f":"(BA56*BC56)+20","v":{"$error":"#N/A"}},{"$f":"IF($AB$9=\"Yes\",30,20)","v":20},40,100,130,20,30,3.8,null,{"$f":"MIN((BO56*BA56),150)","v":{"$error":"#N/A"}}]
[{"$nulls":44},{"$f":"$D$16","v":0},{"$f":"$G$16","v":0},{"$error":"#N/A"},{"$error":"#N/A"},{"$f":"IFERROR(IF(AND(AS56=\"Soybean\",OR($AS57=\"Wheat\",$AS57=\"Wheat w/ Stover\",$AS57=\"Rye\",$AS57=\"Spelt\")),0,INDEX($AY$46:$BR$60,MATCH($AS56,Crop,0),16)),0)","v":0},{"$f":"(INDEX($AY$28:$BP$42,MATCH(AS57,Crop,0),18))-AW57","v":{"$error":"#N/A"}},"Spelt","Bu",{"$error":"#N/A"},0.63,0.37,{"$error":"#N/A"},{"$error":"#N/A"},0,{"$error":"#N/A"},{"$f":"(BA57*BC57)+20","v":{"$error":"#N/A"}},30,50,100,130,20,0,1.3,{"$f":"-27+(BO57*BA57)","v":{"$error":"#N/A"}},{"$f":"BP57","v":{"$error":"#N/A"}}]
[{"$nulls":48},"N Credit",null,"Tomato ","Ton",{"$error":"#N/A"},2.18,7,{"$error":"#N/A"},{"$error":"#N/A"},1,{"$error":"#N/A"},{"$f":"(BA58*BC58)+20","v":{"$error":"#N/A"}},50,{"$f":"BI58+30","v":80},100,130,20,0,null,80]
[{"$nulls":50},"Wheat","Bu",{"$error":"#N/A"},0.5,0.25,{"$error":"#N/A"},{"$f":"BA59*BB59","v":{"$error":"#N/A"}},0,{"$error":"#N/A"},{"$f":"(BA59*BC59)+20","v":{"$error":"#N/A"}},30,50,100,130,20,0,1.3,{"$f":"40+(1.75*(BA59-50))","v":{"$error":"#N/A"}},{"$f":"BP59","v":{"$error":"#N/A"}}]
[{"$nulls":50},"Wheat w/Stover","Bu",{"$error":"#N/A"},0.59,1.16,{"$error":"#N/A"},{"$f":"BA60*BB60","v":{"$error":"#N/A"}},0,{"$error":"#N/A"},{"$f":"(BA60*BC60)+20","v":{"$error":"#N/A"}},30,50,100,130,20,0,1.3,{"$f":"40+(1.75*(BA60-50))","v":{"$error":"#N/A"}},{"$f":"BP60","v":{"$error":"#N/A"}}]
[]
[{"$nulls":50},1,2,3,4,5,6,7,8,9,10,11,12,13,14,15,16,17,18,19]
[{"$nulls":51},"Unit","YP","P","K","P Buildup","P Maintenance","No Apply","K Buildup","K Maintenance","P Critical Level","P Upper Level","K CL","K ML","K Divisor","N Credit","NRemoval","NRx","Max N"]
[{"$nulls":50},"Alfalfa","Ton",{"$f":"INDEX($AS$72:$AT$75,MATCH($AY64,$AS$36:$AS$39,0),2)","v":{"$error":"#N/A"}},12,49,{"$f":"((($BI64-$AU$71)*5)+(BE64))","v":{"$error":"#N/A"}},{"$f":"BA64*BB64","v":{"$error":"#N/A"}},0,{"$f":"(($BK64-$AV$71)*((1+(0.05*$AW$71)))+(BA64*BC64)+20)","v":{"$error":"#N/A"}},{"$f":"((BA64*BC64)+20)-(((BA64*BC64)+20)*($AV$71-BK64)/BM64)","v":{"$error":"#N/A"}},30,{"$f":"BI64+20","v":50},{"$f":"IF($V$10<5.1,100,120)","v":100},{"$f":"IF(BK64=120,BK64+50,BK64+30)","v":130},50,140,40,null,{"$f":"MIN((BO64*BA64),150)","v":{"$error":"#N/A"}}]
[{"$nulls":50},"Barley","Bu",{"$f":"INDEX($AS$72:$AT$75,MATCH($AY65,$AS$36:$AS$39,0),2)","v":{"$error":"#N/A"}},0.25,0.2,{"$error":"#N/A"},{"$f":"BA65*BB65","v":{"$error":"#N/A"}},0,{"$error":"#N/A"},{"$f":"(BA65*BC65)+20","v":{"$error":"#N/A"}},30,{"$f":"BI65+20","v":50},{"$f":"IF($V$10<5.1,100,120)","v":100},{"$f":"IF(BK65=120,BK65+50,BK65+30)","v":130},20,0,1,{"$f":"-27+(BO65*BA65)","v":{"$error":"#N/A"}},{"$f":"BP65","v":{"$error":"#N/A"}}]
[{"$nulls":50},"Corn","Bu",{"$error":"#N/A"},0.35,0.2,{"$error":"#N/A"},{"$f":"BA66*BB66","v":{"$error":"#N/A"}},0,{"$f":"(($BK66-$AV$71)*((1+(0.05*$AW$71)))+(BA66*BC66)+20)","v":{"$error":"#N/A"}},{"$f":"(BA66*BC66)+20","v":{"$error":"#N/A"}},{"$f":"IF($AB$9=\"Yes\",30,20)","v":20},40,100,130,20,0,1.36,{"$error":"#N/A"},{"$error":"#N/A"}]
[{"$nulls":50},"Corn silage","Ton",{"$error":"#N/A"},3.1,7.3,{"$error":"#N/A"},{"$error":"#N/A"},0,{"$error":"#N/A"},{"$f":"((BA67*BC67)+20)-(((BA67*BC67)+20)*($AV$71-BK67)/BM67)","v":{"$error":"#N/A"}},{"$f":"IF($AB$9=\"Yes\",30,20)","v":20},40,100,130,50,0,9.4,{"$error":"#N/A"},{"$error":"#N/A"}]
[{"$nulls":50},"Grass pasture","Ton",{"$error":"#N/A"},12,49,{"$error":"#N/A"},{"$error":"#N/A"},0,{"$error":"#N/A"},{"$f":"((BA68*BC68)+20)-(((BA68*BC68)+20)*($AV$71-BK68)/BM68)","v":{"$error":"#N/A"}},30,50,100,130,50,40,40,{"$error":"#N/A"},{"$error":"#N/A"}]
[{"$nulls":44},"Recommendations",{"$nulls":5},"Legume pasture","Ton",{"$error":"#N/A"},12,49,{"$error":"#N/A"},{"$error":"#N/A"},0,{"$error":"#N/A"},{"$f":"((BA69*BC69)+20)-(((BA69*BC69)+20)*($AV$71-BK69)/BM69)","v":{"$error":"#N/A"}},30,50,100,130,50,100,40,{"$error":"#N/A"},{"$error":"#N/A"}]
[{"$nulls":46},"P","K","CEC","N Rec","Oats","Bu",{"$error":"#N/A"},0.25,0.19,{"$error":"#N/A"},{"$error":"#N/A"},0,{"$error":"#N/A"},{"$f":"(BA70*BC70)+20","v":{"$error":"#N/A"}},30,50,100,130,20,0,0.7,{"$error":"#N/A"},{"$error":"#N/A"}]
[{"$nulls":46},{"$f":"IFERROR(IF(AND($E$8=\"Bray P1\",$E$10=\"ppm\"),ROUND(($X$10*1.35),0),IF(AND($E$8=\"Bray P1\",$E$10=\"lb/ac\"),ROUND((($X$10/2)*1.35),0),IF(AND($E$8=\"Mehlich III\",$E$10=\"ppm\"),$X$10,($X$10/2)))),0)","v":0},{"$f":"IF(E10=\"ppm\",Z10,Z10/2)","v":0},{"$f":"V10","v":{"v":0,"d":"0.0"}},null,"Rye","Bu",{"$error":"#N/A"},0.64,0.36,{"$error":"#N/A"},{"$error":"#N/A"},0,{"$error":"#N/A"},{"$f":"(BA71*BC71)+20","v":{"$error":"#N/A"}},30,50,100,130,20,0,1.3,{"$f":"40+(1.75*(BA71-50))","v":{"$error":"#N/A"}},{"$error":"#N/A"}]
[{"$nulls":44},{"$f":"$D$13","v":0},{"$f":"$G$13","v":0},{"$f":"IF($AU$71<=VLOOKUP($AS72,$AY$63:$BQ$78,11),\"P Buildup\",IF(AND($AU$71>=VLOOKUP($AS72,$AY$63:$BQ$78,11),$AU$71<=VLOOKUP($AS72,$AY$63:$BQ$78,12)),\"P Maintenance\", \"No Apply\"))","v":{"$error":"#N/A"}},{"$f":"IF($AV$71>VLOOKUP($AS72,$AY$63:$BQ$78,14),\"No Apply\",IF($AV$71<=VLOOKUP($AS72,$AY$63:$BQ$78,13),\"K Buildup\",\"K Maintenance\"))","v":{"$error":"#N/A"}},{"$f":"+IFERROR(IF(AND(AS71=\"Soybean\",OR($AS72=\"Wheat\",$AS72=\"Wheat w/ Stover\",$AS72=\"Rye\",$AS72=\"Spelt\")),0,INDEX($AY$64:$BR$78,MATCH($AS71,Crop,0),16)),0)","v":0},{"$f":"(INDEX($AY$28:$BP$42,MATCH(AS72,Crop,0),18))-AW72","v":{"$error":"#N/A"}},"Sorghum","Bu",{"$error":"#N/A"},0.22,0.22,{"$error":"#N/A"},{"$error":"#N/A"},0,{"$error":"#N/A"},{"$error":"#N/A"},{"$f":"IF($AB$9=\"Yes\",30,20)","v":20},40,100,130,20,0,0.7,{"$f":"-27+(BO72*BA72)","v":{"$error":"#N/A"}},{"$error":"#N/A"}]
[{"$nulls":44},{"$f":"$D$14","v":0},{"$f":"$G$14","v":0},{"$f":"IF($AU$71<=VLOOKUP($AS73,$AY$63:$BQ$78,11),\"P Buildup\",IF(AND($AU$71>=VLOOKUP($AS73,$AY$63:$BQ$78,11),$AU$71<=VLOOKUP($AS73,$AY$63:$BQ$78,12)),\"P Maintenance\", \"No Apply\"))","v":{"$error":"#N/A"}},{"$f":"IF($AV$71>VLOOKUP($AS73,$AY$63:$BQ$78,14),\"No Apply\",IF($AV$71<=VLOOKUP($AS73,$AY$63:$BQ$78,13),\"K Buildup\",\"K Maintenance\"))","v":{"$error":"#N/A"}},{"$f":"+IFERROR(IF(AND(AS72=\"Soybean\",OR($AS73=\"Wheat\",$AS73=\"Wheat w/ Stover\",$AS73=\"Rye\",$AS73=\"Spelt\")),0,INDEX($AY$64:$BR$78,MATCH($AS72,Crop,0),16)),0)","v":0},{"$f":"(INDEX($AY$28:$BP$42,MATCH(AS73,Crop,0),18))-AW73","v":{"$error":"#N/A"}},"Sorghum-sudan forage","Ton",{"$error":"#N/A"},4.6,18,{"$error":"#N/A"},{"$error":"#N/A"},0,{"$error":"#N/A"},{"$f":"((BA73*BC73)+20)-(((BA73*BC73)+20)*($AV$71-BK73)/BM73)","v":{"$error":"#N/A"}},30,50,100,130,50,0,40,{"$f":"-27+(BO73*BA73)","v":{"$error":"#N/A"}},{"$error":"#N/A"}]
[{"$nulls":44},{"$f":"$D$15","v":0},{"$f":"$G$15","v":0},{"$error":"#N/A"},{"$error":"#N/A"},{"$f":"+IFERROR(IF(AND(AS73=\"Soybean\",OR($AS74=\"Wheat\",$AS74=\"Wheat w/ Stover\",$AS74=\"Rye\",$AS74=\"Spelt\")),0,INDEX($AY$64:$BR$78,MATCH($AS73,Crop,0),16)),0)","v":0},{"$f":"(INDEX($AY$28:$BP$42,MATCH(AS74,Crop,0),18))-AW74","v":{"$error":"#N/A"}},"Soybean","Bu",{"$error":"#N/A"},0.8,1.15,{"$error":"#N/A"},{"$error":"#N/A"},0,{"$error":"#N/A"},{"$f":"(BA74*BC74)+20","v":{"$error":"#N/A"}},{"$f":"IF($AB$9=\"Yes\",30,20)","v":20},40,100,130,20,30,3.8,null,{"$f":"MIN((BO74*BA74),150)","v":{"$error":"#N/A"}}]
[{"$nulls":44},{"$f":"$D$16","v":0},{"$f":"$G$16","v":0},{"$error":"#N/A"},{"$error":"#N/A"},{"$f":"+IFERROR(IF(AND(AS74=\"Soybean\",OR($AS75=\"Wheat\",$AS75=\"Wheat w/ Stover\",$AS75=\"Rye\",$AS75=\"Spelt\")),0,INDEX($AY$64:$BR$78,MATCH($AS74,Crop,0),16)),0)","v":0},{"$f":"(INDEX($AY$28:$BP$42,MATCH(AS75,Crop,0),18))-AW75","v":{"$error":"#N/A"}},"Spelt","Bu",{"$error":"#N/A"},0.63,0.37,{"$error":"#N/A"},{"$error":"#N/A"},0,{"$error":"#N/A"},{"$f":"(BA75*BC75)+20","v":{"$error":"#N/A"}},30,50,100,130,20,0,1.3,{"$f":"-27+(BO75*BA75)","v":{"$error":"#N/A"}},{"$f":"BP75","v":{"$error":"#N/A"}}]
[{"$nulls":48},"N Credit",null,"Tomato ","Ton",{"$error":"#N/A"},2.18,7,{"$error":"#N/A"},{"$error":"#N/A"},1,{"$error":"#N/A"},{"$error":"#N/A"},50,{"$f":"BI76+30","v":80},100,130,20,0,null,80]
[{"$nulls":50},"Wheat","Bu",{"$error":"#N/A"},0.5,0.25,{"$error":"#N/A"},{"$f":"BA77*BB77","v":{"$error":"#N/A"}},0,{"$error":"#N/A"},{"$error":"#N/A"},30,50,100,130,20,0,1.3,{"$f":"40+(1.75*(BA77-50))","v":{"$error":"#N/A"}},{"$f":"BP77","v":{"$error":"#N/A"}}]
[{"$nulls":50},"Wheat w/Stover","Bu",{"$error":"#N/A"},0.59,1.16,{"$error":"#N/A"},{"$f":"BA78*BB78","v":{"$error":"#N/A"}},0,{"$error":"#N/A"},{"$error":"#N/A"},30,50,100,130,20,0,1.3,{"$f":"40+(1.75*(BA78-50))","v":{"$error":"#N/A"}},{"$f":"BP78","v":{"$error":"#N/A"}}]
[]
[{"$nulls":44},"County",null,"Recommendation",null,null,"P Rx","K Rx","P Rx","K Rx","P Rx","K Rx","P Rate","K Rate","P Rate","K Rate","P Rate","K Rate"]
[{"$nulls":44},"Adams",null,{"$f":"A17","v":""},"Nutrient Credits",null,{"$f":"$L$17","v":0},{"$f":"$N$17","v":0}]
[{"$nulls":44},"Allen",null,0,null,{"$f":"IFERROR(INDEX(CommonFert,MATCH(AU82,FertList,0),6),\"\")","v":""},{"$f":"MAX(0,$L$13-($AX$81))","v":0},{"$f":"MAX(0,$N$13-($AY$81))","v":0},{"$f":"MAX(0,$R$13-($AX$81))","v":0},{"$f":"MAX(0,$T$13-($AY$81))","v":0},{"$f":"MAX(0,$X$13-($AX$81))","v":0},{"$f":"MAX(0,$Z$13-($AY$81))","v":0},{"$f":"IF(INDEX($BF$3:$BK$17,MATCH($AU82,$BF$3:$BF$17,0),6)=\"gal.\",AX82/(INDEX($BF$3:$BK$17,MATCH($AU82,$BF$3:$BF$17,0),4))/(INDEX($BF$3:$BK$17,MATCH($AU82,$BF$3:$BF$17,0),2)),AX82/(INDEX($BF$3:$BK$17,MATCH($AU82,$BF$3:$BF$17,0),4)))","v":{"$error":"#N/A"}},{"$f":"IF(INDEX($BF$3:$BK$17,MATCH($AU82,$BF$3:$BF$17,0),6)=\"gal.\",AY82/(INDEX($BF$3:$BK$17,MATCH($AU82,$BF$3:$BF$17,0),5))/(INDEX($BF$3:$BK$17,MATCH($AU82,$BF$3:$BF$17,0),2)),AY82/(INDEX($BF$3:$BK$17,MATCH($AU82,$BF$3:$BF$17,0),5)))","v":{"$error":"#N/A"}},{"$f":"IF(INDEX($BF$3:$BK$17,MATCH($AU82,$BF$3:$BF$17,0),6)=\"gal.\",AZ82/(INDEX($BF$3:$BK$17,MATCH($AU82,$BF$3:$BF$17,0),4))/(INDEX($BF$3:$BK$17,MATCH($AU82,$BF$3:$BF$17,0),2)),AZ82/(INDEX($BF$3:$BK$17,MATCH($AU82,$BF$3:$BF$17,0),4)))","v":{"$error":"#N/A"}},{"$f":"IF(INDEX($BF$3:$BK$17,MATCH($AU82,$BF$3:$BF$17,0),6)=\"gal.\",BA82/(INDEX($BF$3:$BK$17,MATCH($AU82,$BF$3:$BF$17,0),5))/(INDEX($BF$3:$BK$17,MATCH($AU82,$BF$3:$BF$17,0),2)),BA82/(INDEX($BF$3:$BK$17,MATCH($AU82,$BF$3:$BF$17,0),5)))","v":{"$error":"#N/A"}},{"$f":"IF(INDEX($BF$3:$BK$17,MATCH($AU82,$BF$3:$BF$17,0),6)=\"gal.\",BB82/(INDEX($BF$3:$BK$17,MATCH($AU82,$BF$3:$BF$17,0),4))/(INDEX($BF$3:$BK$17,MATCH($AU82,$BF$3:$BF$17,0),2)),BB82/(INDEX($BF$3:$BK$17,MATCH($AU82,$BF$3:$BF$17,0),4)))","v":{"$error":"#N/A"}},{"$f":"IF(INDEX($BF$3:$BK$17,MATCH($AU82,$BF$3:$BF$17,0),6)=\"gal.\",BC82/(INDEX($BF$3:$BK$17,MATCH($AU82,$BF$3:$BF$17,0),5))/(INDEX($BF$3:$BK$17,MATCH($AU82,$BF$3:$BF$17,0),2)),BC82/(INDEX($BF$3:$BK$17,MATCH($AU82,$BF$3:$BF$17,0),5)))","v":{"$error":"#N/A"}}]
[{"$nulls":44},"Ashland",null,0,null,"",{"$f":"MAX(0,$L$13-($AX$81))","v":0},{"$f":"MAX(0,$N$13-($AY$81))","v":0},{"$f":"MAX(0,$R$13-($AX$81))","v":0},{"$f":"MAX(0,$T$13-($AY$81))","v":0},{"$f":"MAX(0,$X$13-($AX$81))","v":0},{"$f":"MAX(0,$Z$13-($AY$81))","v":0},{"$f":"IF(INDEX($BF$3:$BK$17,MATCH(AU83,$BF$3:$BF$17,0),6)=\"gal.\",AX83/(INDEX($BF$3:$BK$17,MATCH(AU83,$BF$3:$BF$17,0),4))/(INDEX($BF$3:$BK$17,MATCH(AU83,$BF$3:$BF$17,0),2)),AX83/(INDEX($BF$3:$BK$17,MATCH(AU83,$BF$3:$BF$17,0),4)))","v":{"$error":"#N/A"}},{"$error":"#N/A"},{"$error":"#N/A"},{"$error":"#N/A"},{"$error":"#N/A"},{"$error":"#N/A"}]
[{"$nulls":44},"Ashtabula",null,"","Nutrient Credits","",{"$f":"$L$20","v":0},{"$f":"$N$20","v":0},{"$nulls":4},{"$error":"#N/A"},{"$error":"#N/A"},{"$error":"#N/A"},{"$error":"#N/A"},{"$error":"#N/A"},{"$error":"#N/A"}]
[{"$nulls":44},"Athens",null,0,null,"",{"$f":"MAX(0,$L$14-($AX$84))","v":0},{"$f":"MAX(0,$N$14-($AY$84))","v":0},{"$f":"MAX(0,$R$14-($AX$84))","v":0},{"$f":"MAX(0,$T$14-($AY$84))","v":0},{"$f":"MAX(0,$X$14-($AX$84))","v":0},{"$f":"MAX(0,$Z$14-($AY$84))","v":0},{"$error":"#N/A"},{"$error":"#N/A"},{"$error":"#N/A"},{"$error":"#N/A"},{"$error":"#N/A"},{"$error":"#N/A"}]
[{"$nulls":44},"Auglaize",null,0,null,"",{"$f":"MAX(0,$L$14-($AX$84))","v":0},{"$f":"MAX(0,$N$14-($AY$84))","v":0},{"$f":"MAX(0,$R$14-($AX$84))","v":0},{"$f":"MAX(0,$T$14-($AY$84))","v":0},{"$f":"MAX(0,$X$14-($AX$84))","v":0},{"$f":"MAX(0,$Z$14-($AY$84))","v":0},{"$error":"#N/A"},{"$error":"#N/A"},{"$error":"#N/A"},{"$error":"#N/A"},{"$error":"#N/A"},{"$error":"#N/A"}]
[{"$nulls":44},"Belmont",null,"","Nutrient Credits","",{"$f":"$L$23","v":0},{"$f":"$N$23","v":0},{"$nulls":4},{"$error":"#N/A"},{"$error":"#N/A"},{"$error":"#N/A"},{"$error":"#N/A"},{"$error":"#N/A"},{"$error":"#N/A"}]
[{"$nulls":44},"Brown",null,0,null,"",{"$f":"MAX(0,$L$15-($AX$87))","v":0},{"$f":"MAX(0,$N$15-($AY$87))","v":0},{"$f":"MAX(0,$R$15-($AX$87))","v":0},{"$f":"MAX(0,$T$15-($AY$87))","v":0},{"$f":"MAX(0,$X$15-($AX$87))","v":0},{"$f":"MAX(0,$Z$15-($AY$87))","v":0},{"$error":"#N/A"},{"$error":"#N/A"},{"$error":"#N/A"},{"$error":"#N/A"},{"$error":"#N/A"},{"$error":"#N/A"}]
[{"$nulls":44},"Butler",null,0,null,"",{"$f":"MAX(0,$L$15-($AX$87))","v":0},{"$f":"MAX(0,$N$15-($AY$87))","v":0},{"$f":"MAX(0,$R$15-($AX$87))","v":0},{"$f":"MAX(0,$T$15-($AY$87))","v":0},{"$f":"MAX(0,$X$15-($AX$87))","v":0},{"$f":"MAX(0,$Z$15-($AY$87))","v":0},{"$error":"#N/A"},{"$error":"#N/A"},{"$error":"#N/A"},{"$error":"#N/A"},{"$error":"#N/A"},{"$error":"#N/A"}]
[{"$nulls":44},"Carroll",null,"","Nutrient Credits",null,{"$f":"$L$26","v":0},{"$f":"$N$26","v":0},{"$nulls":4},{"$error":"#N/A"},{"$error":"#N/A"},{"$error":"#N/A"},{"$error":"#N/A"},{"$error":"#N/A"},{"$error":"#N/A"}]
[{"$nulls":44},"Champaign",null,0,null,{"$f":"IFERROR(INDEX(CommonFert,MATCH(AU91,FertList,0),6),\"\")","v":""},{"$f":"MAX(0,$L$16-($AX$90))","v":0},{"$f":"MAX(0,$N$16-($AY$90))","v":0},{"$f":"MAX(0,$R$16-($AX$90))","v":0},{"$f":"MAX(0,$T$16-($AY$90))","v":0},{"$f":"MAX(0,$X$16-($AX$90))","v":0},{"$f":"MAX(0,$Z$16-($AY$90))","v":0},{"$error":"#N/A"},{"$error":"#N/A"},{"$error":"#N/A"},{"$error":"#N/A"},{"$error":"#N/A"},{"$error":"#N/A"}]
[{"$nulls":44},"Clark",null,0,null,{"$f":"IFERROR(INDEX(CommonFert,MATCH(AU92,FertList,0),6),\"\")","v":""},{"$f":"MAX(0,$L$16-($AX$90))","v":0},{"$f":"MAX(0,$N$16-($AY$90))","v":0},{"$f":"MAX(0,$R$16-($AX$90))","v":0},{"$f":"MAX(0,$T$16-($AY$90))","v":0},{"$f":"MAX(0,$X16-($AX$90))","v":0},{"$f":"MAX(0,$Z$16-($AY$90))","v":0},{"$error":"#N/A"},{"$error":"#N/A"},{"$error":"#N/A"},{"$error":"#N/A"},{"$error":"#N/A"},{"$error":"#N/A"}]
[{"$nulls":44},"Clermont"]
[{"$nulls":44},"Clinton"]
[{"$nulls":44},"Columbiana"]
[{"$nulls":44},"Coshocton"]
[{"$nulls":44},"Crawford"]
[{"$nulls":44},"Cuyahoga"]
[{"$nulls":44},"Darke"]
[{"$nulls":44},"Defiance"]
[{"$nulls":44},"Delaware"]
[{"$nulls":44},"Erie"]
[{"$nulls":44},"Fairfield"]
[{"$nulls":44},"Fayette"]
[{"$nulls":44},"Franklin"]
[{"$nulls":44},"Fulton"]
[{"$nulls":44},"Gallia"]
[{"$nulls":44},"Geauga"]
[{"$nulls":44},"Greene"]
[{"$nulls":44},"Guernsey"]
[{"$nulls":44},"Hamilton"]
[{"$nulls":44},"Hancock"]
[{"$nulls":44},"Hardin"]
[{"$nulls":44},"Harrison"]
[{"$nulls":44},"Henry"]
[{"$nulls":44},"Highland"]
[{"$nulls":44},"Hocking"]
[{"$nulls":44},"Holmes"]
[{"$nulls":44},"Huron"]
[{"$nulls":44},"Jackson"]
[{"$nulls":44},"Jefferson"]
[{"$nulls":44},"Knox"]
[{"$nulls":44},"Lake"]
[{"$nulls":44},"Lawrence"]
[{"$nulls":44},"Licking"]
[{"$nulls":44},"Logan"]
[{"$nulls":44},"Lorain"]
[{"$nulls":44},"Lucas"]
[{"$nulls":44},"Madison"]
[{"$nulls":44},"Mahoning"]
[{"$nulls":44},"Marion"]
[{"$nulls":44},"Medina"]
[{"$nulls":44},"Meigs"]
[{"$nulls":44},"Mercer"]
[{"$nulls":44},"Miami"]
[{"$nulls":44},"Monroe"]
[{"$nulls":44},"Montgomery"]
[{"$nulls":44},"Morgan"]
[{"$nulls":44},"Morrow"]
[{"$nulls":44},"Muskingum"]
[{"$nulls":44},"Noble"]
[{"$nulls":44},"Ottawa"]
[{"$nulls":44},"Paulding"]
[{"$nulls":44},"Perry"]
[{"$nulls":44},"Pickaway"]
[{"$nulls":44},"Pike"]
[{"$nulls":44},"Portage"]
[{"$nulls":44},"Preble"]
[{"$nulls":44},"Putnam"]
[{"$nulls":44},"Richland"]
[{"$nulls":44},"Ross"]
[{"$nulls":44},"Sandusky"]
[{"$nulls":44},"Scioto"]
[{"$nulls":44},"Seneca"]
[{"$nulls":44},"Shelby"]
[{"$nulls":44},"Stark"]
[{"$nulls":44},"Summit"]
[{"$nulls":44},"Trumbull"]
[{"$nulls":44},"Tuscarawas"]
[{"$nulls":44},"Union"]
[{"$nulls":44},"Van Wert"]
[{"$nulls":44},"Vinton"]
[{"$nulls":44},"Warren"]
[{"$nulls":44},"Washington"]
[{"$nulls":44},"Wayne"]
[{"$nulls":44},"Williams"]
[{"$nulls":44},"Wood"]
[{"$nulls":44},"Wyandot"]

{"sheet":"Updates","index":7,"n_rows":6,"n_cols":2,"rows_kept":6}
["OVNMP V2.17.2020","Complete Update.  Please contact kip.studer@agri.ohio.gov, if you have any issues or questions on outputs"]
["OVNMP V3.11.2020","Updated Potassium Reference Error on VRT Review Tool, Added \"Add Field\" Button"]
["OVNMP V9.15.2020","Updated Tomato crop, Consistent with Purdue Manure Management Planner 0.38, Added several new fertilizer products, Corrected Wheat credit after soybeans"]
["OVNMP V1.15.2021","Updated and added Tri-State 2020 equations to spreadsheet, corrected reference errors on VRT Review Tool for potassium."]
["OVNMP V3.5.2021","Corrected error on second Custom Fertilizer calculations for all sheets, Nutrient Recs do not appear until soil test information is entered"]
["OVNMP V5.27.2021","Added Farm Summary"]

{"sheet":"Nutrient Price Calculator","index":8,"n_rows":37,"n_cols":10,"rows_kept":37,"hidden":true,"merged":[[0,0,1,10],[3,0,3,10],[5,0,5,10],[6,0,6,6],[6,7,6,8],[6,9,6,10],[7,0,7,6],[7,7,7,8],[7,9,7,10],[9,0,9,10],[10,0,10,6],[10,7,10,8],[10,9,10,10],[11,0,11,6],[11,7,11,8],[11,9,11,10],[12,0,12,6],[12,7,12,8],[12,9,12,10],[14,0,17,10],[18,0,18,10],[19,0,21,1],[19,2,20,4],[19,5,20,6],[19,7,20,7],[19,8,20,8],[19,9,20,10],[21,5,21,6],[21,9,21,10],[22,0,22,1],[22,5,22,6],[22,9,22,10],[23,0,23,1],[23,5,23,6],[23,9,23,10],[24,0,24,1],[24,5,24,6],[24,9,24,10],[26,0,26,10],[27,0,29,1],[27,2,28,4],[27,5,28,6],[27,7,28,7],[27,8,28,8],[27,9,28,10],[29,5,29,6],[29,9,29,10],[30,0,30,1],[30,5,30,6],[30,9,30,10],[31,0,31,1],[31,5,31,6],[31,9,31,10],[32,0,32,1],[32,5,32,6],[32,9,32,10],[34,0,34,10],[35,0,35,6],[35,7,35,8],[35,9,35,10],[36,0,36,6],[36,7,36,8],[36,9,36,10]]}
["Nutrient Price Calculator"]
[]
[]
["Step 1. Determine the Value of Nitrogen by Entering Current Prices for the Following Fertilizers"]
[]
["Dry Fertilizers"]
["Fertilizer Type(Analysis)",{"$nulls":6},"Cost ($/ton)",null,"Nitrogen Cost ($/lb)"]
["Urea (46-0-0)",{"$nulls":6},{"v":410,"d":"$410.00"},null,{"$f":"(H8/(20*46))","v":{"v":0.44565217391304346,"d":"$0.446"}}]
[]
["Liquid Fertilizers"]
["Fertilizer Type(Analysis)",{"$nulls":6},"Cost ($/ton)",null,"Nitrogen Cost ($/lb)"]
["28% (28-0-0)",{"$nulls":6},{"v":260,"d":"$260.00"},null,{"$f":"(H12/(20*28))","v":{"v":0.4642857142857143,"d":"$0.464"}}]
["Anhydrous Ammonia (82-0-0)",{"$nulls":6},{"v":650,"d":"$650.00"},null,{"$f":"(H13/(20*82))","v":{"v":0.39634146341463417,"d":"$0.396"}}]
[]
["Step 2. Enter the current prices for the fertilizers below.  For the nitrogen credit; answer yes if the nitrogen in the applied fertilizer will be credited for the following crop, No if it will not be credited.  (Fall application of fertilizer should be answered with No)"]
[]
[]
[]
["Phosphate Prices for Selected Fertilizers"]
["Fertilizer Name",null,"Analysis",null,null,"Fertilizer Cost",null,"Nitrogen Value","Nitrogen Credit?","Phosphate Cost   "]
[]
[null,null,"N","P","K"," ($/ton)",null," ($/lb)","Y / N","($/lb)"]
["MAP",null,11,52,0,{"v":564,"d":"$564.00"},null,{"v":0.446,"d":"$0.446"},"YES",{"$f":"IF(I23=\"NO\",(F23/(D23*20)),((F23-(H23*C23*20))/(D23*20)))","v":{"v":0.44796153846153847,"d":"$0.448"}}]
["DAP",null,18,46,0,null,null,{"v":0.446,"d":"$0.446"},"NO",{"$f":"IF(I24=\"NO\",(F24/(D24*20)),((F24-(H24*C24*20))/(D24*20)))","v":0}]
["Starter",null,10,34,0,{"v":485,"d":"$485.00"},null,{"v":0.464,"d":"$0.464"},"YES",{"$f":"IF(I25=\"NO\",(F25/(D25*20)),((F25-(H25*C25*20))/(D25*20)))","v":{"v":0.576764705882353,"d":"$0.577"}}]
[]
["Sulfur Prices for Selected Fertilizers"]
["Fertilizer Name",null,"Analysis",null,null,"Fertilizer Cost",null,"Nitrogen Value","Nitrogen Credit?","Sulfur Cost"]
[]
[null,null,"N","P/K","S"," ($/ton)",null," ($/lb)","Y / N","($/lb)"]
["ThioSul (liquid)",null,12,0,26,{"v":277,"d":"$277.00"},null,{"v":0.464,"d":"$0.464"},"NO",{"$f":"IF(I31=\"NO\",(F31/(E31*20)),((F31-(H31*C31*20))/(E31*20)))","v":{"v":0.5326923076923077,"d":"$0.533"}}]
["Amm. Sulfate (dry)",null,21,0,24,{"v":353,"d":"$353.00"},null,{"v":0.446,"d":"$0.446"},"YES",{"$f":"IF(I32=\"NO\",(F32/(E32*20)),((F32-(H32*C32*20))/(E32*20)))","v":{"v":0.3451666666666667,"d":"$0.345"}}]
["Elemental Sulfur",null,0,0,91,{"v":604,"d":"$604.00"},null,{"v":0.446,"d":"$0.446"},"NO",{"$f":"IF(I33=\"NO\",(F33/(E33*20)),((F33-(H33*C33*20))/(E33*20)))","v":{"v":0.33186813186813185,"d":"$0.332"}}]
[]
["Potash Prices for Selected Fertilizers"]
["Fertilizer Type(Analysis)",{"$nulls":6},"Cost ($/ton)",null,"Nitrogen Cost ($/lb)"]
["Potassium Chloride (0-0-60)",{"$nulls":6},{"v":401,"d":"$401.00"},null,{"$f":"(H37/(20*60))","v":{"v":0.33416666666666667,"d":"$0.334"}}]

{"sheet":"Nutrient Price Calculator (2)","index":9,"n_rows":93,"n_cols":19,"rows_kept":93,"hidden":true,"merged":[[0,0,1,9],[0,10,1,18],[2,1,2,3],[2,4,2,6],[2,7,2,9],[2,11,2,12],[2,13,2,14],[2,15,2,16],[2,17,2,18],[3,1,3,3],[3,4,3,6],[3,7,3,9],[3,11,3,12],[3,13,3,14],[3,15,3,16],[3,17,3,18],[6,1,8,2],[6,3,8,3],[6,4,8,5],[6,6,8,6],[6,7,8,8],[6,9,8,9],[6,11,8,12],[6,13,8,14],[6,15,8,16],[6,17,8,18],[7,0,8,0],[7,10,8,10],[9,1,9,2],[9,4,9,5],[9,7,9,8],[9,11,9,12],[9,13,9,14],[9,15,9,16],[9,17,9,18],[10,1,10,2],[10,4,10,5],[10,7,10,8],[10,11,10,12],[10,13,10,14],[10,15,10,16],[10,17,10,18],[11,1,11,2],[11,4,11,5],[11,7,11,8],[11,11,11,12],[11,13,11,14],[11,15,11,16],[11,17,11,18],[12,1,12,2],[12,4,12,5],[12,7,12,8],[12,11,12,12],[12,13,12,14],[12,15,12,16],[12,17,12,18],[13,1,13,2],[13,4,13,5],[13,7,13,8],[13,11,13,12],[13,13,13,14],[13,15,13,16],[13,17,13,18],[14,1,14,2],[14,4,14,5],[14,7,14,8],[14,11,14,12],[14,13,14,14],[14,15,14,16],[14,17,14,18],[15,1,15,2],[15,4,15,5],[15,7,15,8],[15,11,15,12],[15,13,15,14],[15,15,15,16],[15,17,15,18],[16,1,16,2],[16,4,16,5],[16,7,16,8],[16,11,16,12],[16,13,16,14],[16,15,16,16],[16,17,16,18],[17,1,17,2],[17,4,17,5],[17,7,17,8],[17,11,17,12],[17,13,17,14],[17,15,17,16],[17,17,17,18],[18,1,18,2],[18,4,18,5],[18,7,18,8],[18,11,18,12],[18,13,18,14],[18,15,18,16],[18,17,18,18],[19,1,19,2],[19,4,19,5],[19,7,19,8],[19,11,19,12],[19,13,19,14],[19,15,19,16],[19,17,19,18],[20,1,20,2],[20,4,20,5],[20,7,20,8],[20,11,20,12],[20,13,20,14],[20,15,20,16],[20,17,20,18],[21,1,21,2],[21,4,21,5],[21,7,21,8],[21,11,21,12],[21,13,21,14],[21,15,21,16],[21,17,21,18],[22,1,22,2],[22,4,22,5],[22,7,22,8],[22,11,22,12],[22,13,22,14],[22,15,22,16],[22,17,22,18],[23,1,23,2],[23,4,23,5],[23,7,23,8],[23,11,23,12],[23,13,23,14],[23,15,23,16],[23,17,23,18],[24,1,24,2],[24,4,24,5],[24,7,24,8],[24,11,24,12],[24,13,24,14],[24,15,24,16],[24,17,24,18],[25,1,25,2],[25,4,25,5],[25,7,25,8],[25,11,25,12],[25,13,25,14],[25,15,25,16],[25,17,25,18],[26,1,26,2],[26,4,26,5],[26,7,26,8],[26,11,26,12],[26,13,26,14],[26,15,26,16],[26,17,26,18],[27,1,27,2],[27,4,27,5],[27,7,27,8],[27,11,27,12],[27,13,27,14],[27,15,27,16],[27,17,27,18],[28,1,28,2],[28,4,28,5],[28,7,28,8],[28,11,28,12],[28,13,28,14],[28,15,28,16],[28,17,28,18],[29,1,29,2],[29,4,29,5],[29,7,29,8],[29,11,29,12],[29,13,29,14],[29,15,29,16],[29,17,29,18],[30,1,30,2],[30,4,30,5],[30,7,30,8],[30,11,30,12],[30,13,30,14],[30,15,30,16],[30,17,30,18],[31,1,31,2],[31,4,31,5],[31,7,31,8],[31,11,31,12],[31,13,31,14],[31,15,31,16],[31,17,31,18],[32,1,32,2],[32,4,32,5],[32,7,32,8],[32,11,32,12],[32,13,32,14],[32,15,32,16],[32,17,32,18],[33,1,33,2],[33,4,33,5],[33,7,33,8],[33,11,33,12],[33,13,33,14],[33,15,33,16],[33,17,33,18],[34,1,34,2],[34,4,34,5],[34,7,34,8],[34,11,34,12],[34,13,34,14],[34,15,34,16],[34,17,34,18],[35,1,35,2],[35,4,35,5],[35,7,35,8],[35,11,35,12],[35,13,35,14],[35,15,35,16],[35,17,35,18],[36,1,36,2],[36,4,36,5],[36,7,36,8],[36,11,36,12],[36,13,36,14],[36,15,36,16],[36,17,36,18],[37,1,37,2],[37,4,37,5],[37,7,37,8],[37,11,37,12],[37,13,37,14],[37,15,37,16],[37,17,37,18],[38,1,38,2],[38,4,38,5],[38,7,38,8],[38,11,38,12],[38,13,38,14],[38,15,38,16],[38,17,38,18],[39,1,39,2],[39,4,39,5],[39,7,39,8],[39,11,39,12],[39,13,39,14],[39,15,39,16],[39,17,39,18],[40,1,40,2],[40,4,40,5],[40,7,40,8],[40,11,40,12],[40,13,40,14],[40,15,40,16],[40,17,40,18],[41,1,41,2],[41,4,41,5],[41,7,41,8],[41,11,41,12],[41,13,41,14],[41,15,41,16],[41,17,41,18],[42,1,42,2],[42,4,42,5],[42,7,42,8],[42,11,42,12],[42,13,42,14],[42,15,42,16],[42,17,42,18],[43,1,43,2],[43,4,43,5],[43,7,43,8],[43,11,43,12],[43,13,43,14],[43,15,43,16],[43,17,43,18],[44,1,44,2],[44,4,44,5],[44,7,44,8],[44,11,44,12],[44,13,44,14],[44,15,44,16],[44,17,44,18],[45,1,45,2],[45,4,45,5],[45,7,45,8],[45,11,45,12],[45,13,45,14],[45,15,45,16],[45,17,45,18],[46,1,46,2],[46,4,46,5],[46,7,46,8],[46,11,46,12],[46,13,46,14],[46,15,46,16],[46,17,46,18],[47,0,48,9],[49,1,49,4],[49,5,49,9],[50,1,50,4],[50,5,50,9],[51,1,51,2],[51,5,51,6],[51,7,51,8],[52,1,52,2],[52,5,52,6],[52,7,52,8],[53,1,54,4],[53,5,54,9],[54,0,55,0],[55,1,55,4],[55,5,55,9],[56,1,56,2],[56,5,56,6],[56,7,56,8],[57,1,57,2],[57,5,57,6],[57,7,57,8],[58,1,58,2],[58,5,58,6],[58,7,58,8],[59,1,59,2],[59,5,59,6],[59,7,59,8],[60,1,60,2],[60,5,60,6],[60,7,60,8],[61,1,61,2],[61,5,61,6],[61,7,61,8],[62,1,62,2],[62,5,62,6],[62,7,62,8],[63,1,63,2],[63,5,63,6],[63,7,63,8],[64,1,64,2],[64,5,64,6],[64,7,64,8],[65,1,65,2],[65,5,65,6],[65,7,65,8],[66,1,66,2],[66,5,66,6],[66,7,66,8],[67,1,67,2],[67,5,67,6],[67,7,67,8],[69,0,70,9],[71,1,71,4],[71,6,71,9],[72,3,72,4],[72,8,72,9],[73,0,74,0],[73,3,73,4],[73,5,74,5],[73,8,73,9],[74,1,74,4],[74,6,74,9],[75,3,75,4],[75,8,75,9],[76,3,76,4],[76,8,76,9],[77,3,77,4],[77,8,77,9],[78,3,78,4],[78,8,78,9],[79,3,79,4],[79,8,79,9],[80,3,80,4],[80,8,80,9],[81,3,81,4],[81,8,81,9],[82,3,82,4],[82,8,82,9],[83,3,83,4],[83,8,83,9],[84,3,84,4],[84,8,84,9],[85,3,85,4],[85,8,85,9],[86,3,86,4],[86,8,86,9],[87,3,87,4],[87,8,87,9],[88,3,88,4],[88,8,88,9],[89,3,89,4],[89,8,89,9],[90,3,90,4],[90,8,90,9],[91,3,91,4],[91,8,91,9],[92,3,92,4],[92,8,92,9]]}
["Phosphorus Fertilizers - Application Rate Lookup Chart",{"$nulls":9},"Nitrogen Fertilizers - Application Rate Lookup Chart"]
[]
[null,"MAP",null,null,"DAP",null,null,"APP",{"$nulls":3},"Liquid UAN 28%",null,"Liquid UAN 32%",null,"Anhydrous Amm.",null,"Urea"]
[null,"Analysis",null,null,"Analysis",null,null,"Analysis",{"$nulls":3},"Analysis",null,"Analysis",null,"Analysis",null,"Analysis"]
[null,"N","P","K","N","P","K","N","P","K",null,"N","P - K","N","P - K","N","P - K","N","P - K"]
[null,11,52,0,18,46,0,10,34,0,null,28,"0 - 0",32,"0 - 0",82,"0 - 0",46,"0 - 0"]
[null,"Application Rate",null,"Incidental Nitrogen App.","Application Rate",null,"Incidental Nitrogen App.","Application Rate",null,"Incidental Nitrogen App.",null,"Application Rate",null,"Application Rate",null,"Application Rate",null,"Application Rate"]
["P2O5 Rec",{"$nulls":9},"N Rec"]
[]
[null,"lb/acre",null,"lb/acre","lb/acre",null,"lb/acre","gal/acre",null,"lb/acre",null,"gal/acre",null,"gal/acre",null,"lb/acre",null,"lb/acre"]
[30,{"$f":"($A11/(C$6/100))","v":{"v":57.69230769230769,"d":"57.7"}},null,{"$f":"(B11*B$6/100)","v":{"v":6.346153846153847,"d":"6.3"}},{"$f":"($A11/(F$6/100))","v":{"v":65.21739130434783,"d":"65.2"}},null,{"$f":"(E11*E$6/100)","v":{"v":11.73913043478261,"d":"11.7"}},{"$f":"($A11/(I$6/100))/11.65","v":{"v":7.573844988639232,"d":"7.6"}},null,{"$f":"(H11*H$6/100)*11.65","v":{"v":8.823529411764705,"d":"8.8"}},10,{"$f":"($K11/($L$6/100))/10.67","v":{"v":3.3471682956219033,"d":"3.3"}},null,{"$f":"($K11/($N$6/100))/11.06","v":{"v":2.825497287522604,"d":"2.8"}},null,{"$f":"$K11/(P$6/100)","v":{"v":12.195121951219512,"d":"12"}},null,{"$f":"$K11/(R$6/100)","v":{"v":21.73913043478261,"d":"22"}}]
[35,{"v":67.3076923076923,"d":"67.3"},null,{"v":7.403846153846153,"d":"7.4"},{"v":76.08695652173913,"d":"76.1"},null,{"v":13.695652173913043,"d":"13.7"},{"v":8.836152486745771,"d":"8.8"},null,{"v":10.294117647058824,"d":"10.3"},{"$f":"K11+5","v":15},{"v":5.020752443432856,"d":"5.0"},null,{"v":4.238245931283906,"d":"4.2"},null,{"v":18.29268292682927,"d":"18"},null,{"v":32.608695652173914,"d":"33"}]
[40,{"v":76.92307692307692,"d":"76.9"},null,{"v":8.46153846153846,"d":"8.5"},{"v":86.95652173913044,"d":"87.0"},null,{"v":15.65217391304348,"d":"15.7"},{"v":10.09845998485231,"d":"10.1"},null,{"v":11.764705882352942,"d":"11.8"},20,{"v":6.694336591243807,"d":"6.7"},null,{"v":5.650994575045208,"d":"5.7"},null,{"v":24.390243902439025,"d":"24"},null,{"v":43.47826086956522,"d":"43"}]
[{"$f":"A13+5","v":45},{"v":86.53846153846153,"d":"86.5"},null,{"v":9.519230769230768,"d":"9.5"},{"v":97.82608695652173,"d":"97.8"},null,{"v":17.608695652173914,"d":"17.6"},{"v":11.360767482958847,"d":"11.4"},null,{"v":13.235294117647056,"d":"13.2"},25,{"v":8.367920739054759,"d":"8.4"},null,{"v":7.0637432188065095,"d":"7.1"},null,{"v":30.48780487804878,"d":"30"},null,{"v":54.347826086956516,"d":"54"}]
[50,{"v":96.15384615384615,"d":"96.2"},null,{"v":10.576923076923077,"d":"10.6"},{"v":108.69565217391303,"d":"108.7"},null,{"v":19.565217391304344,"d":"19.6"},{"v":12.623074981065388,"d":"12.6"},null,{"v":14.705882352941178,"d":"14.7"},30,{"v":10.041504886865711,"d":"10.0"},null,{"v":8.476491862567812,"d":"8.5"},null,{"v":36.58536585365854,"d":"37"},null,{"v":65.21739130434783,"d":"65"}]
[55,{"v":105.76923076923076,"d":"105.8"},null,{"v":11.634615384615383,"d":"11.6"},{"v":119.56521739130434,"d":"119.6"},null,{"v":21.52173913043478,"d":"21.5"},{"v":13.885382479171925,"d":"13.9"},null,{"v":16.176470588235293,"d":"16.2"},35,{"v":11.715089034676662,"d":"11.7"},null,{"v":9.889240506329113,"d":"9.9"},null,{"v":42.6829268292683,"d":"43"},null,{"v":76.08695652173913,"d":"76"}]
[60,{"v":115.38461538461539,"d":"115.4"},null,{"v":12.692307692307693,"d":"12.7"},{"v":130.43478260869566,"d":"130.4"},null,{"v":23.47826086956522,"d":"23.5"},{"v":15.147689977278464,"d":"15.1"},null,{"v":17.64705882352941,"d":"17.6"},40,{"v":13.388673182487613,"d":"13.4"},null,{"v":11.301989150090415,"d":"11.3"},null,{"v":48.78048780487805,"d":"49"},null,{"v":86.95652173913044,"d":"87"}]
[65,{"v":125,"d":"125.0"},null,{"v":13.75,"d":"13.8"},{"v":141.30434782608694,"d":"141.3"},null,{"v":25.43478260869565,"d":"25.4"},{"v":16.409997475385,"d":"16.4"},null,{"v":19.117647058823525,"d":"19.1"},45,{"v":15.062257330298566,"d":"15.1"},null,{"v":12.714737793851718,"d":"12.7"},null,{"v":54.87804878048781,"d":"55"},null,{"v":97.82608695652173,"d":"98"}]
[70,{"v":134.6153846153846,"d":"134.6"},null,{"v":14.807692307692307,"d":"14.8"},{"v":152.17391304347825,"d":"152.2"},null,{"v":27.391304347826086,"d":"27.4"},{"v":17.672304973491542,"d":"17.7"},null,{"v":20.58823529411765,"d":"20.6"},50,{"v":16.735841478109517,"d":"16.7"},null,{"v":14.127486437613019,"d":"14.1"},null,{"v":60.97560975609756,"d":"61"},null,{"v":108.69565217391303,"d":"109"}]
[75,{"v":144.23076923076923,"d":"144.2"},null,{"v":15.865384615384615,"d":"15.9"},{"v":163.04347826086956,"d":"163.0"},null,{"v":29.34782608695652,"d":"29.3"},{"v":18.93461247159808,"d":"18.9"},null,{"v":22.058823529411764,"d":"22.1"},55,{"v":18.40942562592047,"d":"18.4"},null,{"v":15.540235081374322,"d":"15.5"},null,{"v":67.07317073170732,"d":"67"},null,{"v":119.56521739130434,"d":"120"}]
[80,{"v":153.84615384615384,"d":"153.8"},null,{"v":16.92307692307692,"d":"16.9"},{"v":173.91304347826087,"d":"173.9"},null,{"v":31.30434782608696,"d":"31.3"},{"v":20.19691996970462,"d":"20.2"},null,{"v":23.529411764705884,"d":"23.5"},60,{"v":20.083009773731423,"d":"20.1"},null,{"v":16.952983725135624,"d":"17.0"},null,{"v":73.17073170731707,"d":"73"},null,{"v":130.43478260869566,"d":"130"}]
[85,{"v":163.46153846153845,"d":"163.5"},null,{"v":17.98076923076923,"d":"18.0"},{"v":184.78260869565216,"d":"184.8"},null,{"v":33.26086956521739,"d":"33.3"},{"v":21.459227467811157,"d":"21.5"},null,{"v":25,"d":"25.0"},{"$f":"K21+10","v":70},{"v":23.430178069353325,"d":"23.4"},null,{"v":19.778481012658226,"d":"19.8"},null,{"v":85.3658536585366,"d":"85"},null,{"v":152.17391304347825,"d":"152"}]
[90,{"v":173.07692307692307,"d":"173.1"},null,{"v":19.038461538461537,"d":"19.0"},{"v":195.65217391304347,"d":"195.7"},null,{"v":35.21739130434783,"d":"35.2"},{"v":22.721534965917694,"d":"22.7"},null,{"v":26.470588235294112,"d":"26.5"},80,{"v":26.777346364975227,"d":"26.8"},null,{"v":22.60397830018083,"d":"22.6"},null,{"v":97.5609756097561,"d":"98"},null,{"v":173.91304347826087,"d":"174"}]
[95,{"v":182.69230769230768,"d":"182.7"},null,{"v":20.096153846153847,"d":"20.1"},{"v":206.52173913043478,"d":"206.5"},null,{"v":37.17391304347826,"d":"37.2"},{"v":23.98384246402423,"d":"24.0"},null,{"v":27.941176470588236,"d":"27.9"},90,{"v":30.124514660597132,"d":"30.1"},null,{"v":25.429475587703436,"d":"25.4"},null,{"v":109.75609756097562,"d":"110"},null,{"v":195.65217391304347,"d":"196"}]
[100,{"v":192.3076923076923,"d":"192.3"},null,{"v":21.153846153846153,"d":"21.2"},{"v":217.39130434782606,"d":"217.4"},null,{"v":39.13043478260869,"d":"39.1"},{"v":25.246149962130776,"d":"25.2"},null,{"v":29.411764705882355,"d":"29.4"},100,{"v":33.471682956219034,"d":"33.5"},null,{"v":28.254972875226038,"d":"28.3"},null,{"v":121.95121951219512,"d":"122"},null,{"v":217.39130434782606,"d":"217"}]
[105,{"v":201.9230769230769,"d":"201.9"},null,{"v":22.211538461538456,"d":"22.2"},{"v":228.26086956521738,"d":"228.3"},null,{"v":41.08695652173913,"d":"41.1"},{"v":26.508457460237313,"d":"26.5"},null,{"v":30.882352941176475,"d":"30.9"},110,{"v":36.81885125184094,"d":"36.8"},null,{"v":31.080470162748643,"d":"31.1"},null,{"v":134.14634146341464,"d":"134"},null,{"v":239.1304347826087,"d":"239"}]
[110,{"v":211.53846153846152,"d":"211.5"},null,{"v":23.269230769230766,"d":"23.3"},{"v":239.1304347826087,"d":"239.1"},null,{"v":43.04347826086956,"d":"43.0"},{"v":27.77076495834385,"d":"27.8"},null,{"v":32.35294117647059,"d":"32.4"},120,{"v":40.166019547462845,"d":"40.2"},null,{"v":33.90596745027125,"d":"33.9"},null,{"v":146.34146341463415,"d":"146"},null,{"v":260.8695652173913,"d":"261"}]
[115,{"v":221.15384615384616,"d":"221.2"},null,{"v":24.326923076923077,"d":"24.3"},{"v":250,"d":"250.0"},null,{"v":45,"d":"45.0"},{"v":29.033072456450387,"d":"29.0"},null,{"v":33.8235294117647,"d":"33.8"},130,{"v":43.513187843084744,"d":"43.5"},null,{"v":36.73146473779385,"d":"36.7"},null,{"v":158.53658536585368,"d":"159"},null,{"v":282.6086956521739,"d":"283"}]
[120,{"v":230.76923076923077,"d":"230.8"},null,{"v":25.384615384615387,"d":"25.4"},{"v":260.8695652173913,"d":"260.9"},null,{"v":46.95652173913044,"d":"47.0"},{"v":30.29537995455693,"d":"30.3"},null,{"v":35.29411764705882,"d":"35.3"},140,{"v":46.86035613870665,"d":"46.9"},null,{"v":39.55696202531645,"d":"39.6"},null,{"v":170.7317073170732,"d":"171"},null,{"v":304.3478260869565,"d":"304"}]
[125,{"v":240.3846153846154,"d":"240.4"},null,{"v":26.44230769230769,"d":"26.4"},{"v":271.7391304347826,"d":"271.7"},null,{"v":48.91304347826087,"d":"48.9"},{"v":31.557687452663465,"d":"31.6"},null,{"v":36.764705882352935,"d":"36.8"},150,{"v":50.207524434328555,"d":"50.2"},null,{"v":42.38245931283906,"d":"42.4"},null,{"v":182.9268292682927,"d":"183"},null,{"v":326.0869565217391,"d":"326"}]
[130,{"v":250,"d":"250.0"},null,27.5,{"v":282.6086956521739,"d":"282.6"},null,{"v":50.8695652173913,"d":"50.9"},{"v":32.81999495077,"d":"32.8"},null,{"v":38.23529411764705,"d":"38.2"},160,{"v":53.55469272995045,"d":"53.6"},null,{"v":45.20795660036166,"d":"45.2"},null,{"v":195.1219512195122,"d":"195"},null,{"v":347.82608695652175,"d":"348"}]
[135,{"v":259.6153846153846,"d":"259.6"},null,{"v":28.557692307692307,"d":"28.6"},{"v":293.4782608695652,"d":"293.5"},null,{"v":52.82608695652173,"d":"52.8"},{"v":34.08230244887654,"d":"34.1"},null,{"v":39.70588235294117,"d":"39.7"},170,{"v":56.901861025572366,"d":"56.9"},null,{"v":48.033453887884264,"d":"48.0"},null,{"v":207.31707317073173,"d":"207"},null,{"v":369.5652173913043,"d":"370"}]
[140,{"v":269.2307692307692,"d":"269.2"},null,{"v":29.615384615384613,"d":"29.6"},{"v":304.3478260869565,"d":"304.3"},null,{"v":54.78260869565217,"d":"54.8"},{"v":35.344609946983084,"d":"35.3"},null,{"v":41.1764705882353,"d":"41.2"},180,{"v":60.249029321194264,"d":"60.2"},null,{"v":50.85895117540687,"d":"50.9"},null,{"v":219.51219512195124,"d":"220"},null,{"v":391.30434782608694,"d":"391"}]
[145,{"v":278.8461538461538,"d":"278.8"},null,{"v":30.67307692307692,"d":"30.7"},{"v":315.2173913043478,"d":"315.2"},null,{"v":56.73913043478261,"d":"56.7"},{"v":36.60691744508962,"d":"36.6"},null,{"v":42.647058823529406,"d":"42.6"},190,{"v":63.59619761681617,"d":"63.6"},null,{"v":53.684448462929474,"d":"53.7"},null,{"v":231.70731707317074,"d":"232"},null,{"v":413.04347826086956,"d":"413"}]
[150,{"v":288.46153846153845,"d":"288.5"},null,{"v":31.73076923076923,"d":"31.7"},{"v":326.0869565217391,"d":"326.1"},null,{"v":58.69565217391304,"d":"58.7"},{"v":37.86922494319616,"d":"37.9"},null,{"v":44.11764705882353,"d":"44.1"},200,{"v":66.94336591243807,"d":"66.9"},null,{"v":56.509945750452076,"d":"56.5"},null,{"v":243.90243902439025,"d":"244"},null,{"v":434.78260869565213,"d":"435"}]
[155,{"v":298.0769230769231,"d":"298.1"},null,{"v":32.78846153846154,"d":"32.8"},{"v":336.95652173913044,"d":"337.0"},null,{"v":60.65217391304348,"d":"60.7"},{"v":39.1315324413027,"d":"39.1"},null,{"v":45.58823529411765,"d":"45.6"},210,{"v":70.29053420805997,"d":"70.3"},null,{"v":59.33544303797468,"d":"59.3"},null,{"v":256.0975609756098,"d":"256"},null,{"v":456.52173913043475,"d":"457"}]
[160,{"v":307.6923076923077,"d":"307.7"},null,{"v":33.84615384615384,"d":"33.8"},{"v":347.82608695652175,"d":"347.8"},null,{"v":62.60869565217392,"d":"62.6"},{"v":40.39383993940924,"d":"40.4"},null,{"v":47.05882352941177,"d":"47.1"},220,{"v":73.63770250368188,"d":"73.6"},null,{"v":62.160940325497286,"d":"62.2"},null,{"v":268.2926829268293,"d":"268"},null,{"v":478.2608695652174,"d":"478"}]
[165,{"v":317.3076923076923,"d":"317.3"},null,{"v":34.90384615384616,"d":"34.9"},{"v":358.695652173913,"d":"358.7"},null,{"v":64.56521739130434,"d":"64.6"},{"v":41.65614743751578,"d":"41.7"},null,{"v":48.52941176470589,"d":"48.5"},230,{"v":76.98487079930378,"d":"77.0"},null,{"v":64.98643761301989,"d":"65.0"},null,{"v":280.4878048780488,"d":"280"},null,500]
[170,{"v":326.9230769230769,"d":"326.9"},null,{"v":35.96153846153846,"d":"36.0"},{"v":369.5652173913043,"d":"369.6"},null,{"v":66.52173913043478,"d":"66.5"},{"v":42.918454935622314,"d":"42.9"},null,{"v":50,"d":"50.0"},240,{"v":80.33203909492569,"d":"80.3"},null,{"v":67.8119349005425,"d":"67.8"},null,{"v":292.6829268292683,"d":"293"},null,{"v":521.7391304347826,"d":"522"}]
[175,{"v":336.53846153846155,"d":"336.5"},null,{"v":37.019230769230774,"d":"37.0"},{"v":380.4347826086956,"d":"380.4"},null,{"v":68.4782608695652,"d":"68.5"},{"v":44.18076243372885,"d":"44.2"},null,{"v":51.470588235294116,"d":"51.5"},250,{"v":83.67920739054759,"d":"83.7"},null,{"v":70.63743218806509,"d":"70.6"},null,{"v":304.8780487804878,"d":"305"},null,{"v":543.4782608695652,"d":"543"}]
[180,{"v":346.15384615384613,"d":"346.2"},null,{"v":38.07692307692307,"d":"38.1"},{"v":391.30434782608694,"d":"391.3"},null,{"v":70.43478260869566,"d":"70.4"},{"v":45.44306993183539,"d":"45.4"},null,{"v":52.941176470588225,"d":"52.9"},260,{"v":87.02637568616949,"d":"87.0"},null,{"v":73.4629294755877,"d":"73.5"},null,{"v":317.07317073170736,"d":"317"},null,{"v":565.2173913043478,"d":"565"}]
[185,{"v":355.7692307692308,"d":"355.8"},null,{"v":39.13461538461539,"d":"39.1"},{"v":402.17391304347825,"d":"402.2"},null,{"v":72.39130434782608,"d":"72.4"},{"v":46.70537742994193,"d":"46.7"},null,{"v":54.411764705882355,"d":"54.4"},270,{"v":90.3735439817914,"d":"90.4"},null,{"v":76.28842676311031,"d":"76.3"},null,{"v":329.26829268292687,"d":"329"},null,{"v":586.9565217391304,"d":"587"}]
[190,{"v":365.38461538461536,"d":"365.4"},null,{"v":40.19230769230769,"d":"40.2"},{"v":413.04347826086956,"d":"413.0"},null,{"v":74.34782608695652,"d":"74.3"},{"v":47.96768492804846,"d":"48.0"},null,{"v":55.88235294117647,"d":"55.9"},280,{"v":93.7207122774133,"d":"93.7"},null,{"v":79.1139240506329,"d":"79.1"},null,{"v":341.4634146341464,"d":"341"},null,{"v":608.695652173913,"d":"609"}]
[195,{"v":375,"d":"375.0"},null,{"v":41.25,"d":"41.3"},{"v":423.9130434782609,"d":"423.9"},null,{"v":76.30434782608695,"d":"76.3"},{"v":49.22999242615501,"d":"49.2"},null,{"v":57.35294117647059,"d":"57.4"},290,{"v":97.0678805730352,"d":"97.1"},null,{"v":81.93942133815551,"d":"81.9"},null,{"v":353.6585365853659,"d":"354"},null,{"v":630.4347826086956,"d":"630"}]
[200,{"v":384.6153846153846,"d":"384.6"},null,{"v":42.30769230769231,"d":"42.3"},{"v":434.78260869565213,"d":"434.8"},null,{"v":78.26086956521738,"d":"78.3"},{"v":50.49229992426155,"d":"50.5"},null,{"v":58.82352941176471,"d":"58.8"},300,{"v":100.41504886865711,"d":"100.4"},null,{"v":84.76491862567812,"d":"84.8"},null,{"v":365.8536585365854,"d":"366"},null,{"v":652.1739130434783,"d":"652"}]
[205,{"v":394.2307692307692,"d":"394.2"},null,{"v":43.36538461538462,"d":"43.4"},{"v":445.65217391304344,"d":"445.7"},null,{"v":80.21739130434781,"d":"80.2"},{"v":51.75460742236808,"d":"51.8"},null,{"v":60.294117647058805,"d":"60.3"},310,{"v":103.76221716427902,"d":"103.8"},null,{"v":87.59041591320072,"d":"87.6"},null,{"v":378.0487804878049,"d":"378"},null,{"v":673.9130434782609,"d":"674"}]
[210,{"v":403.8461538461538,"d":"403.8"},null,{"v":44.42307692307691,"d":"44.4"},{"v":456.52173913043475,"d":"456.5"},null,{"v":82.17391304347827,"d":"82.2"},{"v":53.016914920474626,"d":"53.0"},null,{"v":61.76470588235295,"d":"61.8"},320,{"v":107.1093854599009,"d":"107.1"},null,{"v":90.41591320072332,"d":"90.4"},null,{"v":390.2439024390244,"d":"390"},null,{"v":695.6521739130435,"d":"696"}]
["Starter Fertilizer Reference Chart"]
[]
[null,"Liquid UAN 28%",{"$nulls":3},"Ammonium Polyphosphate"]
[null,"Analysis",{"$nulls":3},"Analysis"]
[null,"N",null,"P","K","N",null,"P",null,"K"]
[null,28,null,0,0,10,null,34,null,0]
[null,"Nutrients Applied",{"$nulls":3},"Nutrients Applied"]
["App.  Rate"]
[null,"lb/acre",{"$nulls":3},"lb/acre"]
["gal/acre","N",null,"P","K","N",null,"P",null,"K"]
[{"v":5,"d":"5.0"},{"$f":"($A58*10.67*(B$53/100))","v":{"v":14.938000000000002,"d":"14.9"}},null,{"$f":"($A58*10.67*(D$53/100))","v":{"v":0,"d":"0.0"}},{"v":0,"d":"0.0"},{"$f":"($A58*11.65*(F$53/100))","v":{"v":5.825,"d":"5.8"}},null,{"$f":"($A58*11.65*(H$53/100))","v":{"v":19.805,"d":"19.8"}},null,{"$f":"($A58*11.65*(J$53/100))","v":{"v":0,"d":"0.0"}}]
[7.5,{"v":22.407000000000004,"d":"22.4"},null,{"v":0,"d":"0.0"},{"v":0,"d":"0.0"},{"v":8.7375,"d":"8.7"},null,{"v":29.707500000000003,"d":"29.7"},null,{"v":0,"d":"0.0"}]
[{"v":10,"d":"10.0"},{"v":29.876000000000005,"d":"29.9"},null,{"v":0,"d":"0.0"},{"v":0,"d":"0.0"},{"v":11.65,"d":"11.7"},null,{"v":39.61,"d":"39.6"},null,{"v":0,"d":"0.0"}]
[12.5,{"v":37.345000000000006,"d":"37.3"},null,{"v":0,"d":"0.0"},{"v":0,"d":"0.0"},{"v":14.5625,"d":"14.6"},null,{"v":49.5125,"d":"49.5"},null,{"v":0,"d":"0.0"}]
[{"v":15,"d":"15.0"},{"v":44.81400000000001,"d":"44.8"},null,{"v":0,"d":"0.0"},{"v":0,"d":"0.0"},{"v":17.475,"d":"17.5"},null,{"v":59.415000000000006,"d":"59.4"},null,{"v":0,"d":"0.0"}]
[17.5,{"v":52.283,"d":"52.3"},null,{"v":0,"d":"0.0"},{"v":0,"d":"0.0"},{"v":20.387500000000003,"d":"20.4"},null,{"v":69.31750000000001,"d":"69.3"},null,{"v":0,"d":"0.0"}]
[{"v":20,"d":"20.0"},{"v":59.75200000000001,"d":"59.8"},null,{"v":0,"d":"0.0"},{"v":0,"d":"0.0"},23.3,null,{"v":79.22,"d":"79.2"},null,{"v":0,"d":"0.0"}]
[22.5,{"v":67.221,"d":"67.2"},null,{"v":0,"d":"0.0"},{"v":0,"d":"0.0"},{"v":26.212500000000002,"d":"26.2"},null,{"v":89.1225,"d":"89.1"},null,{"v":0,"d":"0.0"}]
[{"v":25,"d":"25.0"},{"v":74.69000000000001,"d":"74.7"},null,{"v":0,"d":"0.0"},{"v":0,"d":"0.0"},{"v":29.125,"d":"29.1"},null,{"v":99.025,"d":"99.0"},null,{"v":0,"d":"0.0"}]
[27.5,{"v":82.159,"d":"82.2"},null,{"v":0,"d":"0.0"},{"v":0,"d":"0.0"},{"v":32.0375,"d":"32.0"},null,{"v":108.92750000000001,"d":"108.9"},null,{"v":0,"d":"0.0"}]
[{"v":30,"d":"30.0"},{"v":89.62800000000001,"d":"89.6"},null,{"v":0,"d":"0.0"},{"v":0,"d":"0.0"},{"v":34.95,"d":"35.0"},null,{"v":118.83000000000001,"d":"118.8"},null,{"v":0,"d":"0.0"}]
[]
["Potassium Chloride"]
[]
[null,"Analysis",{"$nulls":4},"Analysis"]
[null,"N","P","K",null,null,"N","P","K"]
["App.  Rate",0,0,60,null,"App.  Rate",0,0,60]
[null,"lb/acre",{"$nulls":4},"lb/acre"]
["lb/acre","N","P","K",null,"lb/acre","N","P","K"]
[10,{"$f":"$A77*(B$74/100)","v":0},0,{"v":6,"d":"6.0"},null,{"$f":"A93+10","v":180},{"$f":"$F77*(G$74/100)","v":{"v":0,"d":"0.0"}},{"v":0,"d":"0.0"},{"v":108,"d":"108.0"}]
[{"$f":"A77+10","v":20},0,0,{"v":12,"d":"12.0"},null,{"$f":"F77+10","v":190},{"v":0,"d":"0.0"},{"v":0,"d":"0.0"},{"v":114,"d":"114.0"}]
[30,0,0,{"v":18,"d":"18.0"},null,200,{"v":0,"d":"0.0"},{"v":0,"d":"0.0"},{"v":120,"d":"120.0"}]
[40,0,0,{"v":24,"d":"24.0"},null,210,{"v":0,"d":"0.0"},{"v":0,"d":"0.0"},{"v":126,"d":"126.0"}]
[50,0,0,{"v":30,"d":"30.0"},null,220,{"v":0,"d":"0.0"},{"v":0,"d":"0.0"},{"v":132,"d":"132.0"}]
[60,0,0,{"v":36,"d":"36.0"},null,230,{"v":0,"d":"0.0"},{"v":0,"d":"0.0"},{"v":138,"d":"138.0"}]
[70,0,0,{"v":42,"d":"42.0"},null,240,{"v":0,"d":"0.0"},{"v":0,"d":"0.0"},{"v":144,"d":"144.0"}]
[80,0,0,{"v":48,"d":"48.0"},null,250,{"v":0,"d":"0.0"},{"v":0,"d":"0.0"},{"v":150,"d":"150.0"}]
[90,0,0,{"v":54,"d":"54.0"},null,260,{"v":0,"d":"0.0"},{"v":0,"d":"0.0"},{"v":156,"d":"156.0"}]
[100,0,0,{"v":60,"d":"60.0"},null,270,{"v":0,"d":"0.0"},{"v":0,"d":"0.0"},{"v":162,"d":"162.0"}]
[110,0,0,{"v":66,"d":"66.0"},null,280,{"v":0,"d":"0.0"},{"v":0,"d":"0.0"},{"v":168,"d":"168.0"}]
[120,0,0,{"v":72,"d":"72.0"},null,290,{"v":0,"d":"0.0"},{"v":0,"d":"0.0"},{"v":174,"d":"174.0"}]
[130,0,0,{"v":78,"d":"78.0"},null,300,{"v":0,"d":"0.0"},{"v":0,"d":"0.0"},{"v":180,"d":"180.0"}]
[140,0,0,{"v":84,"d":"84.0"},null,310,{"v":0,"d":"0.0"},{"v":0,"d":"0.0"},{"v":186,"d":"186.0"}]
[150,0,0,{"v":90,"d":"90.0"},null,320,{"v":0,"d":"0.0"},{"v":0,"d":"0.0"},{"v":192,"d":"192.0"}]
[160,0,0,{"v":96,"d":"96.0"},null,330,{"v":0,"d":"0.0"},{"v":0,"d":"0.0"},{"v":198,"d":"198.0"}]
[170,0,0,{"v":102,"d":"102.0"},null,340,{"v":0,"d":"0.0"},{"v":0,"d":"0.0"},{"v":204,"d":"204.0"}]